program: Gaussian 09
title: 000104388
version: EM64L-G09RevD.01
frameworkgroup: C1[X(C9H9Cl2NO)]
method: RPBEPBE
basis: SDD
operation: Freq
keyword: #p
keyword: freq=noraman
keyword: PBEPBE/SDD
title: #p freq=noraman PBEPBE/SDD
converged: NO NO NO NO
title: Mulliken charges:
elementType: Cl Cl O N C C C C C C C C C H H H H H H H H H
charge: -0.030144 -0.029814 -0.246579 -0.098172 0.439660 0.155802 -0.261046 -0.262190 -0.602630 -0.606861 -0.238409 -0.238270 -0.207554 0.226782 0.281603 0.226684 0.254435 0.234283 0.234579 0.263085 0.263065 0.241692
chargesum: 0.00000
title: Mulliken charges with hydrogens summed into heavy atoms:
elementType: Cl Cl O N C C C C C C C C C
charge: -0.030144 -0.029814 -0.246579 -0.098172 0.439660 0.155802 -0.261046 -0.262190 0.132439 0.116436 0.024676 0.024795 0.034138
polarizability: 1.51400288e+02 2.79609161e-02 1.38506502e+02 3.17277808e+00 6.07902824e-02 8.17215476e+01
1716.lowfreq: -6.1699 -0.0036 -0.0022 -0.0021 4.5614 9.2294 27.5101 65.0868 72.6427
frequency: 26.9471 65.0863 72.6383 110.5456 126.2394 137.3543 157.3360 171.2923 195.2866 269.1037 275.0395 315.4432 365.6436 369.1940 409.6820 430.1917 432.8878 521.0660 559.8761 636.1102 695.6430 705.1875 741.6114 749.9031 779.3182 897.2174 907.0372 969.9119 1024.2884 1053.1147 1065.2490 1093.5153 1098.1666 1145.5596 1153.4406 1192.2049 1208.0481 1246.2009 1357.5489 1384.3012 1411.8683 1416.9369 1421.8757 1438.7226 1462.9196 1469.7474 1486.8742 1499.7105 1558.3228 1582.2871 1591.7693 2966.9274 2972.8792 3039.0424 3048.9673 3113.4646 3117.2958 3150.6925 3171.1920 3182.2688
redmass: 4.4354 7.5472 2.7447 1.2326 5.8310 1.8340 1.8021 16.3608 4.5703 2.9712 9.0167 4.7461 6.0986 3.5360 4.2565 10.3835 5.8216 5.4174 3.7973 5.8062 8.8856 5.2878 9.8696 3.3979 1.6320 1.3588 4.5273 1.3281 3.4271 1.3961 3.3140 1.2252 2.0627 1.4135 1.4396 1.3971 2.7303 5.9066 10.1895 2.8749 2.1991 1.1657 2.7042 1.2665 1.0414 1.0543 1.0447 1.2892 6.9134 7.0769 7.1816 1.0363 1.0357 1.1015 1.1017 1.0964 1.0978 1.0874 1.0930 1.0996
irintensity: 4.2210 2.1300 0.0007 0.0936 2.9447 0.1730 0.0920 0.2077 0.0123 4.0882 1.0764 4.0432 0.4079 11.8194 11.1498 11.4663 3.7850 0.2970 4.8210 3.2789 13.5566 4.7069 71.7606 30.9815 44.9808 0.0049 0.4418 1.1375 23.8977 6.9124 14.6774 0.1056 94.3122 2.6533 7.4527 13.4674 36.7942 42.8385 7.5756 76.5074 69.0164 38.5326 2.1527 6.8496 4.0381 16.5338 23.7868 12.7195 51.2615 114.9360 224.7503 35.6694 85.6418 30.5643 23.2960 15.8852 1.2263 3.8024 0.8946 6.6633
temp: 298.150 k
press: 1.00000 atm
elementType: 17 17 8 7 6 6 6 6 6 6 6 6 6 1 1 1 1 1 1 1 1 1
symmnumber: 1
zpe: 419998.1 jmol-1
zpe.correction: 0.159969 hartree
zpe.thermalcorrener: 0.173498 hartree
zpe.thermalcorrenthalpy: 0.174442 hartree
zpe.thermalcorrgfe: 0.118370 hartree
zpe.sumelectzpe: -1397.497957 hartree
zpe.sumelectthermal: -1397.484428 hartree
zpe.sumelectthermalent: -1397.483484 hartree
zpe.sumelectthermalfe: -1397.539556 hartree
dipole: 1.0195 0.0351 4.4720
dipole: 4.5868
quadrupole: -70.8055 -91.7114 -96.1690
quadrupole: 0.1025 -4.8161 -0.0564
quadrupole: 15.4231 -5.4827 -9.9404 0.1025 -4.8161 -0.0564
hfenergy: -1397.6579263 hartree
pointgroup: C01 [X(C9H9Cl2N1O1)]
dipole: -0.4335582 -0.0145268 1.7516874 debye
dipolederiv: -0.228002 0.2628682 0.0145835 0.1869758 -0.6497923 -0.0342695 0.0241791 -0.0144982 -0.0529828 -0.2237761 -0.2591546 0.0129114 -0.1832947 -0.6540894 0.0313779 0.0228185 0.0115202 -0.0523858 -0.7429778 -0.002524 0.1568527 -0.0002741 -0.3032169 0.0055832 -0.2156838 0.0047282 -1.1143849 -0.8448603 0.0007419 -0.3829676 -0.0002394 -0.281767 0.0016826 -0.2851307 0.0033143 -0.835471 -0.1798231 0.0012976 0.0533973 0.0013603 -0.4727597 -0.0006286 -0.0128826 -0.0008094 -0.0180409 1.3359565 0.0014209 0.3396097 -0.0007816 0.1789089 -0.0079479 0.6839956 -0.0064663 1.4664398 0.288955 -0.3725533 -0.038969 -0.2548386 0.9675166 0.0407356 -0.0676656 0.0254888 -0.0522357 0.2834259 0.3672205 -0.0368474 0.2496163 0.974313 -0.035962 -0.0649959 -0.0209165 -0.0529041 0.4476549 0.0002374 0.0620219 0.0019968 0.2425098 0.0021336 -0.1321062 0.0013733 -0.0528348 -0.0140684 0.0003891 -0.0356668 -0.0007306 0.2602607 -0.002218 0.0856149 -0.0020115 0.470934 -0.1588171 0.1757255 -0.0030727 0.1051176 -0.2013569 -0.0150195 -0.0063679 -0.0138008 -0.104435 -0.1561185 -0.1756256 -0.0041569 -0.1046808 -0.2039697 0.014413 -0.0069469 0.0131914 -0.1041244 0.0699686 -0.0001746 -0.033824 -0.0004907 0.1462266 0.0005702 -0.0252005 0.0005844 -0.1365823 -0.0501766 -0.0375445 -0.0358912 -0.1251283 -0.069069 -0.0839517 -0.0752085 -0.0980493 0.0759731 0.1740725 0.0002133 -0.0216416 -0.0006607 0.1217169 0.0006877 0.1056968 0.0006854 -0.0094877 -0.0504483 0.0376346 -0.0358557 0.1257587 -0.0703643 0.0823813 -0.0742846 0.0963411 0.0780986 -0.0921716 0.000649 0.0746267 0.0010427 0.0890431 0.0006614 0.0543104 0.0006703 0.0926604 0.0517221 -0.0775901 -0.0744565 -0.0982755 -0.0619186 -0.1268204 -0.044783 -0.0374126 -0.0434235 0.053942 0.0768936 -0.0711731 0.0977639 -0.0660233 0.1273498 -0.0424468 0.0368115 -0.0418292 0.0624564 -0.0440045 0.0129167 -0.0648924 -0.0064776 0.0100082 0.0193734 0.0094067 0.1653603 0.0614891 0.0446283 0.0132342 0.0654369 -0.0054933 -0.0107048 0.0197195 -0.0101414 0.1651986 -0.0884033 -0.0007488 0.0343685 -0.0007816 0.0658024 -0.0000622 0.0379947 -0.0000096 0.1564572 unknown
polarizability: 151.4937381|-0.0134769|138.5065008|-1.8842323|0.018581|81.6280988 unknown
InChI: InChI=1S/C9H9Cl2NO/c1-12(2)9(13)8-6(10)4-3-5-7(8)11/h3-5H,1-2H3
charge 0 multiplicity 1
22 atoms
Cl -0.102182 -2.791852 -0.133061
Cl -0.126623 2.791357 -0.119414
O  1.52077 0.015691 -1.768312
N  2.145661 0.001703 0.48418
C  -0.259748 -0.000767 -0.134938
C  1.211711 0.00672 -0.536388
C  -0.993922 -1.205886 -0.026122
C  -1.004544 1.197295 -0.020655
C  3.57739 0.005471 0.139465
C  1.818172 -0.009231 1.916058
C  -2.386248 -1.237401 0.180078
C  -2.397103 1.215392 0.185712
C  -3.086448 -0.0143 0.27892
H  4.072809 0.903925 0.554555
H  3.670568 0.010956 -0.957319
H  4.075449 -0.895422 0.545993
H  0.727885 -0.004908 2.063902
H  2.243548 0.882566 2.415836
H  2.234484 -0.913509 2.400911
H  -2.907789 -2.195249 0.257347
H  -2.927078 2.168213 0.267523
H  -4.170061 -0.019465 0.433529
