program: Gaussian 09
title: 000104382
version: EM64L-G09RevD.01
frameworkgroup: C1[X(C9H9NO2)]
method: RPBEPBE
basis: SDD
operation: Freq
keyword: #pfreq=noraman
keyword: PBEPBE/SDD
title: #p freq=noraman PBEPBE/SDD
converged: YES YES NO NO
title: Mulliken charges:
elementType: O O N C C C C C C C C C H H H H H H H H H
charge: -0.206743 -0.205480 0.007483 0.304468 -0.483360 0.139688 -0.317430 -0.330581 -0.680659 -0.299968 -0.312304 0.148932 0.236168 0.236661 0.253947 0.288168 0.232781 0.214068 0.232524 0.275623 0.266015
chargesum: 0.00000
title: Mulliken charges with hydrogens summed into heavy atoms:
elementType: O O N C C C C C C C C C
charge: -0.206743 -0.205480 0.007483 0.304468 -0.010531 0.139688 -0.063484 -0.042413 -0.001286 -0.024345 -0.046289 0.148932
polarizability: 1.87584174e+02 -9.88548864e+00 1.10186102e+02 -1.12623916e-02 7.08184785e-03 5.31246504e+01
1716.lowfreq: -4.5686 -0.0001 0.0004 0.0006 5.3906 17.0217 45.4238 64.0068 91.4222
frequency: 45.4139 63.9996 91.4156 127.6238 146.9031 187.7501 229.4578 280.9677 286.6601 299.6840 404.2585 453.8272 456.3229 503.9695 564.9929 619.1263 655.9802 724.7772 726.2592 800.5751 804.7575 854.4888 876.4215 948.9752 995.0038 1001.2096 1011.1339 1020.4739 1070.2787 1092.1076 1096.8013 1109.6629 1185.1668 1213.0449 1244.7584 1294.7033 1332.6394 1341.3888 1394.3814 1399.7485 1413.2218 1433.2966 1469.9793 1474.4766 1477.3055 1563.1789 1597.4897 1610.6324 2966.1369 3001.1421 3011.5989 3098.3956 3104.1976 3145.7930 3152.8955 3164.3179 3171.5072
redmass: 4.0532 3.9734 2.2844 4.7685 6.2705 1.2846 5.2655 5.6723 8.2351 4.0978 2.9061 5.2098 3.2136 7.9181 2.1959 7.0952 5.2367 4.5149 3.0744 1.4553 7.1806 1.3277 1.3939 4.3627 1.3550 2.6391 1.3623 1.5743 1.6717 2.8416 2.6021 1.4366 1.2721 3.0195 1.1845 1.3255 2.4700 4.1370 6.8269 1.2096 4.0050 1.1105 1.0387 2.3379 1.0547 7.6330 7.4639 7.0228 1.0603 1.0362 1.0977 1.1005 1.0999 1.0873 1.0883 1.0962 1.0973
irintensity: 0.2042 6.8306 0.1206 2.8321 0.5672 0.1647 4.4613 1.3879 2.0558 5.9243 0.0004 6.4667 3.7760 3.2844 7.5274 0.8999 0.4333 25.2291 1.1551 51.7250 55.4737 6.9381 35.8063 54.4522 1.2304 3.9656 0.0343 8.7199 2.1763 18.3079 112.4730 44.5325 48.7970 126.6682 0.4003 14.7207 22.4418 214.8994 2.3503 22.1576 30.0780 23.8885 12.7257 0.7083 14.8500 27.4118 32.1607 39.7475 35.9139 26.5918 8.7247 25.0784 28.1139 1.7425 0.4538 10.4745 0.9063
temp: 298.150 k
press: 1.00000 atm
elementType: 8 8 7 6 6 6 6 6 6 6 6 6 1 1 1 1 1 1 1 1 1
symmnumber: 1
zpe: 417572.5 jmol-1
zpe.correction: 0.159045 hartree
zpe.thermalcorrener: 0.170425 hartree
zpe.thermalcorrenthalpy: 0.171370 hartree
zpe.thermalcorrgfe: 0.120936 hartree
zpe.sumelectzpe: -552.614012 hartree
zpe.sumelectthermal: -552.602632 hartree
zpe.sumelectthermalent: -552.601688 hartree
zpe.sumelectthermalfe: -552.652121 hartree
dipole: -2.9110 -2.0259 0.0019
dipole: 3.5466
quadrupole: -91.0139 -66.4906 -70.0329
quadrupole: 10.3692 -0.0038 0.0064
quadrupole: -15.1681 9.3552 5.8129 10.3692 -0.0038 0.0064
hfenergy: -552.773057 hartree
pointgroup: C01 [X(C9H9N1O2)]
dipole: -1.1608669 0.7732801 -0.03731 debye
dipolederiv: -0.8890494 -0.0961451 -0.0112731 -0.2227455 -0.7071873 0.001949 -0.0092339 0.0049522 -0.2873461 -0.8577248 -0.0288891 -0.0150989 -0.9261403 -0.4361951 -0.0152141 -0.0017966 0.00398 -0.1309429 1.6448222 0.1525089 0.0367138 0.6424547 0.2292277 0.0076095 0.0295804 -0.0028895 -0.1781788 -0.5726328 0.0112349 -0.0124145 0.1847342 0.0808197 0.0029393 -0.0156121 -0.0006178 0.0110823 -0.1373091 0.1008097 -0.007264 0.3179381 -0.2839014 0.0130702 -0.0094413 0.0076665 0.1433906 1.6601615 -0.0425909 0.0334904 -0.1544612 0.8343841 -0.0149361 0.035552 -0.0123859 0.1140361 -0.1384168 -0.2654173 0.0038217 -0.1447937 -0.0318402 -0.0044699 0.0014549 -0.0068262 -0.136638 -0.191527 0.27665 -0.0058516 0.0730734 -0.0020713 -0.0000832 -0.002569 0.0041119 -0.1117812 -0.0468491 -0.0177825 -0.0018506 -0.0038165 0.0840976 -0.000104 -0.00211 -0.0001735 0.0608657 0.0490709 0.2293679 -0.0008101 -0.0893149 -0.0498033 -0.0023348 0.0039297 0.0042384 -0.0747021 0.2080829 -0.2496104 0.0102711 0.1232951 0.0441089 0.0005191 0.0047912 -0.0075077 -0.0964777 -1.0845739 -0.1160603 -0.0241016 0.1820275 0.0935809 0.0043972 -0.0286572 -0.0018426 0.1270715 -0.0042856 -0.0269027 -0.0824834 -0.0602327 0.0401252 -0.0715755 -0.0956912 -0.085849 -0.0231853 -0.0116283 -0.0281949 0.0834709 -0.0606186 0.0446767 0.0674753 0.0970756 0.0833134 -0.0192302 0.0426967 0.090962 -0.0032854 0.108745 -0.0124061 0.0044668 -0.0033605 0.00395 0.1373234 0.1136648 -0.0717947 0.0001652 -0.0291039 0.0339497 0.0011719 -0.0005764 0.0003624 0.154337 0.0616707 -0.0127931 0.0269967 -0.0743173 0.0492075 0.1013929 0.0583264 0.0837213 -0.0587066 -0.0379271 0.0928408 -0.0042097 0.165373 -0.0972516 0.0058565 -0.0050874 0.0043814 0.1049782 0.0641151 -0.0100215 -0.0219982 -0.0712171 0.0442744 -0.1072043 -0.0518337 -0.0871319 -0.0577767 0.0787117 -0.0642263 -0.0007409 -0.0076261 0.0239169 0.0019021 -0.0015777 0.0007258 0.1603171 0.0489273 0.0760548 -0.0035478 0.0467468 0.018287 0.0031719 -0.0031631 0.0038209 0.1615638 unknown
polarizability: 187.0923587|11.4793889|110.610884|2.6884167|-0.6294575|53.1916832 unknown
InChI: InChI=1S/C9H9NO2/c1-2-9(11)7-3-5-8(10-12)6-4-7/h3-6H,2H2,1H3
charge 0 multiplicity 1
21 atoms
O  -2.686295 -1.45934 -0.013784
O  4.207572 1.050352 0.093485
N  3.635194 -0.09872 0.098362
C  -0.644289 -0.186701 0.008078
C  -2.998788 0.959437 -0.059942
C  -2.151745 -0.313654 -0.021767
C  0.014245 1.079009 0.003276
C  0.127528 -1.380433 0.04264
C  -4.510848 0.681443 -0.087282
C  1.415285 1.154053 0.032231
C  1.531262 -1.315125 0.071556
C  2.170868 -0.048857 0.066164
H  -2.734013 1.58024 0.821372
H  -2.69685 1.55669 -0.945102
H  -0.572715 2.002419 -0.022041
H  -0.404006 -2.337151 0.045985
H  -4.822398 0.105993 0.800766
H  -5.077111 1.629114 -0.110576
H  -4.786499 0.0845 -0.973138
H  1.947176 2.111629 0.029023
H  2.154326 -2.215398 0.098593
