program: Gaussian 09
title: 000104398
version: EM64L-G09RevD.01
frameworkgroup: C1[X(C12H15ClNO3S2)]
method: RPBEPBE
basis: SDD
operation: Freq
keyword: #p
keyword: freq=noraman
keyword: PBEPBE/SDD
title: #p freq=noraman PBEPBE/SDD
converged: YES YES NO NO
title: Mulliken charges:
elementType: Cl S S O O O N C C C C C C C C C C C C H H H H H H H H H H H H H H H
charge: 0.048565 0.426082 1.048953 -0.563076 -0.491635 -0.504021 -0.144398 -0.445426 -0.371820 -0.310202 0.709658 -0.628434 -0.017978 -0.437192 -0.260010 -0.706757 -0.239789 -0.144455 -0.195992 0.272824 0.267863 0.248924 0.228324 0.251660 0.243420 0.301101 0.300792 0.294094 0.283033 0.286417 0.275602 0.281701 0.293290 0.398882
chargesum: 1.00000
title: Mulliken charges with hydrogens summed into heavy atoms:
elementType: Cl S S O O O N C C C C C C C C C C C C
charge: 0.048565 0.426082 1.048953 -0.164194 -0.491635 -0.504021 -0.144398 0.095261 0.105429 0.184878 0.709658 -0.026541 -0.017978 -0.437192 0.034083 0.138294 0.041911 -0.144455 0.097298
polarizability: 2.36032489e+02 -8.69968602e+00 2.46800460e+02 -1.96229005e+01 -1.86945134e+00 1.21052176e+02
1716.lowfreq: -5.2065 -3.9934 -0.6593 -0.0021 0.0011 0.0029 7.1728 11.8223 32.1670
frequency: 7.0133 11.7393 32.0928 37.8864 73.8818 83.2449 94.0924 116.1289 134.6500 147.6377 150.8103 175.6395 184.3758 195.7726 254.7684 261.2745 282.3639 301.2833 303.8281 310.7199 324.7286 329.3394 357.5353 368.5143 417.6146 429.9306 453.5850 474.8284 529.0248 556.3717 565.2768 596.6332 615.0707 646.6807 666.5639 707.2831 724.0027 756.3733 790.8837 825.6576 834.5081 844.6067 863.9149 893.5657 955.1033 970.0316 979.0112 1011.2959 1019.1043 1026.2263 1033.8243 1051.0583 1073.6018 1077.7726 1082.3834 1085.0005 1157.7312 1162.6181 1200.2848 1239.0188 1241.6356 1265.7741 1283.5703 1292.3681 1301.2606 1312.8425 1354.4115 1366.7597 1389.1955 1406.0241 1419.2834 1424.2695 1432.9165 1454.8222 1458.5769 1477.5069 1481.2920 1491.5817 1510.7145 1577.0756 1592.5156 2985.8559 2988.7937 2997.1982 3037.2317 3038.6248 3061.0850 3061.7863 3070.0181 3104.9633 3118.6969 3153.4727 3172.9188 3179.8080 3189.6892 3494.7887
redmass: 8.6609 10.8443 5.2247 5.9407 5.6542 3.4369 3.1556 2.3320 2.4790 1.5827 3.2372 5.5940 5.2953 2.3455 1.7634 5.4660 4.4337 5.9590 4.0493 5.8109 3.4221 5.2144 6.3841 5.1450 5.7292 3.0552 5.1954 6.0755 5.0116 10.4583 10.9659 5.1736 5.5414 5.4298 4.8024 4.8633 4.3721 1.0956 1.2787 1.3399 3.5641 12.2859 1.4976 1.5735 3.5970 1.3500 3.0546 2.8513 1.5616 5.0162 2.2581 1.8715 1.9726 2.5305 2.2425 1.6785 1.4543 1.5277 3.0504 1.2297 1.5452 1.3372 1.9638 1.1827 1.3413 1.1857 1.3417 1.4001 6.5850 1.1608 1.1085 4.1809 2.4922 1.1049 1.0778 1.1605 1.3871 1.3406 1.5378 8.7610 7.1314 1.0596 1.0404 1.0593 1.0840 1.0792 1.0601 1.1003 1.0970 1.1044 1.0978 1.1112 1.0905 1.0938 1.0983 1.0666
irintensity: 0.4448 2.5581 0.4717 0.5396 2.6035 1.0212 2.9346 0.3706 2.9096 0.4053 0.8024 3.1910 4.7131 19.4812 49.7731 7.4720 7.9367 1.0571 68.6915 18.9071 0.5244 3.0651 35.7617 6.3751 12.1527 10.8155 3.4259 2.5349 8.3922 41.4884 94.5918 4.4890 35.9125 3.6507 1.8293 3.2879 0.6055 10.3674 2.8258 40.1756 18.0413 50.0693 20.3573 4.8402 94.1402 0.0671 1.5710 6.0186 9.9919 4.0609 11.1620 44.4898 32.5884 17.1702 13.3989 14.3843 1.2130 11.2257 55.8402 9.6721 7.5104 9.3883 12.0360 3.2085 18.2143 8.0081 10.5947 3.7002 15.4376 24.5727 7.2953 20.4873 74.7077 22.3143 32.0024 0.6121 6.2213 16.1594 24.0183 25.8290 32.5747 6.2671 3.5324 13.8438 5.1647 3.3220 2.5498 11.8877 0.2951 6.7737 0.2384 0.0517 0.7251 0.5936 2.1049 86.6999
temp: 298.150 k
press: 1.00000 atm
elementType: 17 16 16 8 8 8 7 6 6 6 6 6 6 6 6 6 6 6 6 1 1 1 1 1 1 1 1 1 1 1 1 1 1 1
symmnumber: 1
zpe: 664197.1 jmol-1
zpe.correction: 0.252979 hartree
zpe.thermalcorrener: 0.273778 hartree
zpe.thermalcorrenthalpy: 0.274722 hartree
zpe.thermalcorrgfe: 0.198808 hartree
zpe.sumelectzpe: -2001.045540 hartree
zpe.sumelectthermal: -2001.024741 hartree
zpe.sumelectthermalent: -2001.023797 hartree
zpe.sumelectthermalfe: -2001.099711 hartree
dipole: -10.1035 -6.4033 1.5258
dipole: 12.0586
quadrupole: -90.6770 -108.0012 -132.5251
quadrupole: 6.8855 8.1308 3.9357
quadrupole: 19.7241 2.3999 -22.1240 6.8855 8.1308 3.9357
hfenergy: -2001.298519 hartree
pointgroup: C01 [X(C12H15Cl1N1O3S2)]
dipole: 3.8636096 2.675448 0.6497755 debye
polarizability: 237.1234254|-9.6693683|245.7299773|18.338921|6.5139727|121.0317228 unknown
InChI: InChI=1S/C12H15ClNO3S2/c1-9-14(6-2-3-7-19(15,16)17)11-8-10(13)4-5-12(11)18-9/h4-5,8,15H,2-3,6-7H2,1H3
charge 1 multiplicity 1
34 atoms
Cl 3.021167 -3.827934 -0.37701
S  3.310679 2.484048 0.471565
S  -5.160272 -0.71638 0.013515
O  -5.972256 -0.826247 1.670631
O  -5.219866 -2.136714 -0.756223
O  -5.589434 0.639751 -0.757296
N  1.23045 1.163414 -0.413128
C  -0.148685 0.836225 -0.89408
C  -1.068833 0.339149 0.247304
C  -2.476752 0.025058 -0.317466
C  2.203216 0.147514 -0.181207
C  -3.41908 -0.454795 0.790149
C  1.638512 2.42381 -0.126289
C  3.42548 0.681241 0.307319
C  2.052832 -1.238668 -0.401202
C  0.818261 3.660126 -0.295033
C  4.527797 -0.145419 0.594702
C  3.161238 -2.053763 -0.111719
C  4.386061 -1.530815 0.380703
H  -0.049445 0.074595 -1.687104
H  -0.571616 1.73924 -1.362701
H  -0.636833 -0.561956 0.721348
H  -1.14109 1.116158 1.03274
H  -2.906125 0.930799 -0.788618
H  -2.403598 -0.750984 -1.104535
H  -3.604393 0.289558 1.579816
H  -3.175869 -1.440406 1.215405
H  1.127906 -1.677331 -0.78275
H  1.346781 4.539265 0.104348
H  0.608158 3.857178 -1.363946
H  -0.150258 3.582409 0.231435
H  5.471006 0.259992 0.970218
H  5.218937 -2.207031 0.591004
H  -6.937578 -1.060286 1.550906
