program: Gaussian 09
title: 000104429
version: EM64L-G09RevD.01
frameworkgroup: C1[X(C31H20O8)]
method: RPBEPBE
basis: SDD
operation: Freq
keyword: #pfreq=noraman
keyword: PBEPBE/SDD
title: #p freq=noraman PBEPBE/SDD
converged: NO YES NO NO
title: Mulliken charges:
elementType: O O O O O O O O C C C C C C C C C C C C C C C C C C C C C C C C C C C C C C C H H H H H H H H H H H H H H H H H H H H
charge: -0.266758 -0.285384 -0.236718 -0.233321 -0.145319 -0.168384 -0.192859 -0.146569 0.000012 0.492280 0.491921 -0.750620 -0.753183 -0.376517 -0.406609 -0.366955 -0.407235 -0.387876 -0.410146 -0.390193 -0.394772 0.354059 0.313734 0.255999 -0.021314 0.341567 0.193677 0.173056 -0.457145 -0.376355 0.149141 -0.360424 -0.401642 -0.325157 0.140193 -0.187173 0.128193 0.143907 0.128253 0.217206 0.223737 0.241704 0.237753 0.222383 0.222547 0.239337 0.254879 0.245033 0.258938 0.270665 0.265235 0.267328 0.260086 0.306555 0.283411 0.274074 0.277591 0.277370 0.296804
chargesum: 0.00000
title: Mulliken charges with hydrogens summed into heavy atoms:
elementType: O O O O O O O O C C C C C C C C C C C C C C C C C C C C C C C C C C C C C C C
charge: -0.266758 -0.285384 -0.236718 -0.233321 -0.145319 -0.168384 -0.192859 -0.146569 0.000012 0.492280 0.491921 -0.067973 -0.070500 -0.137180 -0.151730 -0.121922 -0.148297 -0.117211 -0.144911 -0.122865 -0.134686 0.354059 0.313734 0.255999 -0.021314 0.341567 0.193677 0.173056 -0.150590 -0.092944 0.149141 -0.086349 -0.124051 -0.047787 0.140193 0.109631 0.128193 0.143907 0.128253
polarizability: 4.51712995e+02 -1.42022121e+01 4.84823377e+02 -8.45727945e+00 -5.51999240e+00 2.06501371e+02
1716.lowfreq: -4.3628 -2.5930 -0.0004 -0.0003 0.0008 4.7223 16.9811 18.4033 22.6562
frequency: 16.9542 18.3500 22.5875 27.2433 39.2526 42.4948 53.1055 60.1920 64.9522 90.8380 96.7882 103.7735 146.5476 154.5628 159.1845 161.8025 168.4401 170.9051 185.8962 198.8542 201.0604 235.8116 255.9203 264.9822 271.1002 276.7026 280.7228 309.6458 318.4934 327.0154 330.2802 351.0022 359.3386 366.7042 389.6681 403.4238 411.3897 413.0605 425.8207 445.2281 459.0286 471.3041 493.4781 501.2858 509.1588 514.3799 525.6734 530.3578 547.5127 576.2454 581.0516 593.1535 595.7368 623.0717 628.1313 638.4742 643.1391 649.9926 656.4089 661.2322 672.5888 700.2822 704.9553 707.6926 729.3067 733.7678 745.4739 751.9610 753.6706 754.5860 767.4783 768.7157 792.3228 807.8495 823.1026 828.1133 835.8700 838.0266 846.2653 848.9035 855.2530 905.3085 912.7211 922.3991 928.1413 936.8696 939.6060 959.5304 961.9318 972.7486 974.7035 982.8587 1002.9838 1004.5972 1008.4757 1021.7646 1033.6105 1038.1709 1069.6780 1078.4640 1083.9239 1104.4510 1108.7392 1118.3352 1139.4962 1159.5553 1163.1628 1168.7522 1172.4129 1188.4966 1196.1472 1200.4395 1204.9784 1229.6721 1237.2696 1241.7787 1247.8706 1252.9297 1269.1328 1301.5949 1303.3038 1362.9345 1365.8120 1383.4203 1393.8234 1404.1474 1406.1446 1409.9931 1419.7308 1434.5894 1456.4943 1461.4311 1467.3338 1470.3814 1471.7630 1485.9707 1488.5629 1492.8992 1494.6911 1584.8019 1589.6043 1595.9855 1600.6704 1607.1925 1609.3505 1621.0099 1626.4496 1684.8638 1692.9013 1746.8146 1750.9945 2982.8937 2986.3365 3077.8244 3080.8451 3086.9278 3088.9915 3131.6949 3136.1852 3153.9882 3154.7845 3158.2819 3159.3658 3162.2820 3164.2511 3173.5155 3174.4085 3175.2053 3180.0917 3182.9730 3184.8556
redmass: 8.9429 7.9046 7.3168 7.4111 9.5217 8.4054 6.6035 5.1855 3.9168 7.0660 7.3093 6.1892 5.5329 7.3317 9.7534 7.1082 7.0122 9.9333 4.5944 5.6902 4.8802 5.2309 1.9675 3.1303 3.7331 2.5341 2.7175 6.0839 2.2572 6.0361 2.1502 5.0127 3.4427 5.5808 5.1866 4.9781 2.9363 2.9951 3.3232 5.2909 4.3088 4.0233 6.1141 7.4205 6.5643 6.8719 6.2953 4.9890 3.3664 3.8726 4.0467 13.1348 11.5146 6.3726 6.7848 7.4334 6.1044 5.0835 4.9072 5.3240 6.1459 6.8343 7.0026 7.3925 5.2104 5.3400 3.8966 4.6693 5.4478 4.5648 11.0811 11.8030 5.6542 5.9792 5.5125 1.4780 1.2879 1.2936 1.5987 1.7053 1.4626 1.5042 4.8042 2.2366 1.4215 7.3964 1.4795 1.3391 1.3778 1.3646 1.3656 1.3511 1.7542 3.0163 1.9481 1.3290 4.0545 3.3771 3.4641 2.4919 2.0275 1.7473 2.2556 1.3321 1.8001 2.4715 1.8811 2.4127 2.0383 1.9707 1.2978 1.5839 1.6520 3.3573 3.2380 2.9032 3.6124 4.0446 1.7121 1.2712 1.2812 6.0403 6.4095 1.2587 6.4970 1.7185 1.8494 3.3300 8.4476 3.0448 5.2757 2.6068 2.4895 1.1809 1.0909 1.2159 1.9787 1.4834 1.2659 7.4281 7.4160 7.9359 7.7470 6.6977 7.3292 7.1577 7.9893 13.0244 13.0882 12.9707 12.9489 1.0356 1.0361 1.0998 1.1000 1.0994 1.0991 1.0881 1.0877 1.0874 1.0878 1.0967 1.0953 1.0887 1.0895 1.0923 1.0964 1.0963 1.0930 1.0973 1.0990
irintensity: 0.0760 1.3597 0.9026 0.7431 1.1401 2.2900 0.6513 0.1254 0.4060 2.4361 1.6619 1.4660 0.2065 1.9085 0.2907 1.5932 1.0046 0.8220 0.2949 0.1191 0.3513 1.7670 0.4936 2.5224 0.1113 0.1854 1.3555 2.8356 2.0127 3.9622 1.5836 0.9631 0.9990 7.5306 1.6758 3.6715 0.9958 0.0228 1.2379 0.8606 10.8824 2.3281 4.9703 6.8016 17.5733 28.3127 11.6650 7.6745 10.2501 47.1749 5.2939 11.9410 1.5912 1.3955 2.2216 1.7235 2.2808 9.8517 6.2698 7.7687 1.3355 14.3952 5.3899 44.8477 0.1984 3.2202 2.9107 10.1365 1.3136 13.3092 209.4168 162.7945 71.8900 2.3447 48.6412 47.4441 2.7490 12.3098 62.1224 46.6802 32.0347 10.8039 46.5246 3.7712 2.0131 80.0492 1.7115 0.3454 0.2347 0.3683 0.3460 0.0264 7.3348 33.9352 33.3278 0.2899 30.6272 79.0250 1.1625 46.8447 34.6702 13.5549 4.6940 0.0744 22.5196 85.9938 43.0467 2.1112 9.5210 41.1380 28.7948 61.6733 31.4193 9.1662 37.1476 153.5969 377.6451 491.7810 194.1191 0.5565 1.8128 2.7101 3.2480 19.4446 10.5832 12.2399 14.2248 8.7530 7.4538 8.4302 40.9841 206.5604 184.2773 9.3057 9.4835 2.9625 80.5209 80.4262 72.7163 14.2818 2.0059 51.4563 48.2035 19.8664 119.9976 2.7194 132.8016 611.7870 461.6019 261.4988 303.5207 22.6466 28.1521 11.9694 35.1196 41.8973 40.8167 13.3884 10.3230 9.4265 6.0746 5.3211 6.3716 14.9021 0.5910 0.9675 4.0758 2.8739 0.7483 2.2359 5.0104
temp: 298.150 k
press: 1.00000 atm
elementType: 8 8 8 8 8 8 8 8 6 6 6 6 6 6 6 6 6 6 6 6 6 6 6 6 6 6 6 6 6 6 6 6 6 6 6 6 6 6 6 1 1 1 1 1 1 1 1 1 1 1 1 1 1 1 1 1 1 1 1
symmnumber: 1
zpe: 1125737.2 jmol-1
zpe.correction: 0.428771 hartree
zpe.thermalcorrener: 0.460978 hartree
zpe.thermalcorrenthalpy: 0.461922 hartree
zpe.thermalcorrgfe: 0.363088 hartree
zpe.sumelectzpe: -1792.428028 hartree
zpe.sumelectthermal: -1792.395820 hartree
zpe.sumelectthermalent: -1792.394876 hartree
zpe.sumelectthermalfe: -1792.493710 hartree
dipole: -12.8579 6.9326 -0.0828
dipole: 14.6080
quadrupole: -286.5835 -244.3435 -212.3075
quadrupole: 1.9327 -6.8666 -0.1127
quadrupole: -38.8386 3.4013 35.4373 1.9327 -6.8666 -0.1127
hfenergy: -1792.8567982 hartree
pointgroup: C01 [X(C31H20O8)]
dipole: -4.4176252 -3.6736362 -0.1403904 debye
polarizability: 446.944541|6.446503|489.0714825|14.9886176|1.9733921|207.0217199 unknown
InChI: InChI=1S/C31H20O8/c1-31(2,17-6-10-19(11-7-17)36-21-14-15-22-24(16-21)29(34)38-27(22)32)18-8-12-20(13-9-18)37-25-5-3-4-23-26(25)30(35)39-28(23)33/h3-16H,1-2H3
charge 0 multiplicity 1
59 atoms
O  3.862302 -0.547442 0.666613
O  -4.954966 -1.350654 -0.220338
O  6.898278 2.618288 0.06994
O  -2.843544 4.311771 0.269754
O  6.836633 0.284452 0.381736
O  6.240263 4.858572 -0.205291
O  -1.110263 2.740739 0.095485
O  -5.00257 5.270683 0.412106
C  -0.177756 -4.660229 -0.082275
C  0.942123 -3.601826 0.116443
C  -1.514709 -3.872433 -0.120016
C  0.090032 -5.443282 -1.398332
C  -0.229805 -5.699011 1.073797
C  1.091731 -2.570124 -0.851092
C  1.804373 -3.58207 1.240277
C  -1.889456 -3.10874 1.020549
C  -2.353524 -3.816923 -1.259873
C  2.039269 -1.541939 -0.698391
C  2.753782 -2.549835 1.419891
C  -3.028361 -2.284289 1.014385
C  -3.494227 -2.978758 -1.293197
C  2.847378 -1.525728 0.460596
C  -3.800218 -2.2022 -0.164415
C  3.625136 0.809079 0.432597
C  4.750952 1.648786 0.281527
C  -4.780512 0.03081 -0.080521
C  4.576371 3.042713 0.101856
C  -3.496403 2.055667 0.065734
C  -3.505966 0.662715 -0.067788
C  2.33374 1.407996 0.405501
C  -4.681951 2.817308 0.172869
C  -5.983545 0.7865 0.022207
C  3.312398 3.647336 0.063339
C  -5.944053 2.189197 0.147523
C  6.200124 1.334378 0.268552
C  2.184231 2.801296 0.22135
C  5.919021 3.676061 -0.033358
C  -2.32692 2.979062 0.131511
C  -4.326859 4.246279 0.299388
H  -0.701518 -6.193083 -1.582099
H  0.155067 -4.781914 -2.279784
H  1.05232 -5.978092 -1.317385
H  -1.04909 -6.415928 0.889693
H  0.714483 -6.27024 1.131907
H  -0.411598 -5.23265 2.057716
H  0.44482 -2.556722 -1.735601
H  1.741004 -4.367227 1.999473
H  -1.262252 -3.133044 1.918215
H  -2.11559 -4.407613 -2.149075
H  2.146952 -0.767326 -1.464048
H  3.416937 -2.52873 2.289493
H  -3.304353 -1.699847 1.89819
H  -4.127357 -2.914497 -2.183127
H  -2.575673 0.09727 -0.158756
H  1.440558 0.791814 0.539167
H  -6.93302 0.244309 0.001063
H  3.208533 4.726339 -0.079351
H  -6.865044 2.77382 0.227447
H  1.171194 3.214556 0.204723
