program: Gaussian 09
title: 000009090
version: EM64L-G09RevD.01
frameworkgroup: C1[X(C7H12S2)]
method: RPBEPBE
basis: SDD
operation: Freq
keyword: #pfreq=noraman
keyword: PBEPBE/SDD
title: #p freq=noraman PBEPBE/SDD
converged: NO YES NO NO
title: Mulliken charges:
elementType: S S C C C C C C C H H H H H H H H H H H H
charge: 0.215288 0.235837 -0.500520 -0.423811 -0.357576 -0.415544 -0.422091 -0.618321 -0.620581 0.238183 0.251710 0.245806 0.222119 0.213088 0.228531 0.232422 0.211913 0.267836 0.262420 0.275366 0.257925
chargesum: 0.00000
title: Mulliken charges with hydrogens summed into heavy atoms:
elementType: S S C C C C C C C
charge: 0.215288 0.235837 -0.500520 0.066082 0.110350 0.026075 0.022244 -0.088065 -0.087290
polarizability: 1.27537872e+02 2.67181199e+00 9.92137424e+01 3.01343842e+00 -1.61269934e+00 8.13598986e+01
1716.lowfreq: -20.5909 -4.0793 -0.0019 0.0003 0.0024 16.2877 47.7618 55.3074 139.5226
frequency: 47.4813 54.9165 139.4830 193.6765 226.8703 297.7737 321.1147 348.3545 405.6057 439.5931 563.9665 622.0570 625.9067 640.9840 741.5260 784.1141 812.8750 852.0530 883.0571 935.0035 951.8905 953.0289 966.4347 1004.9366 1028.8259 1064.8370 1104.0427 1120.0742 1146.2053 1172.8262 1185.7525 1197.8847 1229.8818 1256.8313 1270.3589 1286.0211 1290.2667 1304.0073 1312.1045 1431.1247 1440.5825 1450.9890 1462.4537 1467.2180 1485.4801 2989.7748 3004.1505 3009.2818 3021.5439 3021.7656 3029.9193 3056.0388 3071.9062 3080.7785 3093.2944 3093.7098 3112.3401
redmass: 2.0304 3.1887 2.8584 2.9430 2.1639 6.0184 2.7293 3.8289 8.5214 3.6851 2.7889 2.8998 6.1538 3.6158 1.9689 1.6628 2.0461 1.5927 2.7333 2.0866 1.5140 2.3130 1.9520 2.3200 1.5256 2.6427 1.0517 4.2237 1.4331 1.3591 1.3681 1.3966 1.1679 1.2538 1.2795 1.1773 1.1793 1.4161 1.4307 1.0835 1.0984 1.0840 1.0805 1.0819 1.0919 1.0648 1.0598 1.0623 1.0588 1.0609 1.0590 1.1022 1.0995 1.1024 1.1041 1.1069 1.1085
irintensity: 0.5252 3.8267 0.2549 0.4599 1.3828 2.7092 1.6138 0.6197 2.3313 0.6646 0.9765 1.7278 4.4582 0.8247 13.9139 5.1775 9.4495 9.0139 4.5089 0.3589 0.8248 8.8660 13.0487 4.5054 1.9029 2.6275 1.2824 2.8918 1.5128 3.6802 1.9149 8.8237 3.8105 3.8779 1.1340 2.0460 10.8530 2.0751 5.7923 12.9072 3.0426 15.2243 7.9363 9.5934 8.9792 16.7183 17.0736 41.4327 26.2827 43.6004 40.9757 8.4638 8.8496 21.3704 49.5006 3.6530 21.7990
temp: 298.150 k
press: 1.00000 atm
elementType: 16 16 6 6 6 6 6 6 6 1 1 1 1 1 1 1 1 1 1 1 1
symmnumber: 1
zpe: 461190.2 jmol-1
zpe.correction: 0.175658 hartree
zpe.thermalcorrener: 0.185175 hartree
zpe.thermalcorrenthalpy: 0.186119 hartree
zpe.thermalcorrgfe: 0.140025 hartree
zpe.sumelectzpe: -1069.346509 hartree
zpe.sumelectthermal: -1069.336993 hartree
zpe.sumelectthermalent: -1069.336048 hartree
zpe.sumelectthermalfe: -1069.382142 hartree
dipole: 0.3619 0.5324 0.7964
dipole: 1.0240
quadrupole: -61.3073 -74.1623 -70.7303
quadrupole: 4.4032 1.1476 1.1135
quadrupole: 7.4260 -5.4290 -1.9970 4.4032 1.1476 1.1135
hfenergy: -1069.5221672 hartree
pointgroup: C01 [X(C7H12S2)]
dipole: -0.1508661 -0.2204914 0.3015694 debye
dipolederiv: -0.304442 0.008839 -0.0150337 -0.0422547 -0.3062863 -0.0077026 -0.0464805 0.0270241 -0.1601138 -0.4054583 0.0355317 -0.0239 0.0838504 -0.2019501 0.0214194 -0.0180571 -0.0001322 -0.1862902 0.5424685 -0.0062903 0.0719731 0.0104797 0.3875185 0.0268866 0.1035191 0.0283069 0.1655183 -0.0389411 0.002953 0.0299046 -0.0156271 0.0008276 0.0151994 -0.0619938 0.0569934 0.0000374 -0.0485301 0.0481699 -0.0227277 -0.0075641 -0.0224673 0.0246847 0.0315887 -0.0584838 -0.0599696 0.0554991 0.0623388 0.0046007 0.036504 0.1023818 0.0759696 0.0158887 0.0559756 0.0223928 0.0036674 0.0854686 0.0296754 0.0228898 0.1137676 -0.0143789 0.0002978 0.0514911 0.0199993 0.1683261 -0.1014928 -0.0675456 -0.0732835 0.0299863 0.0343933 -0.1079313 -0.0555156 0.135112 0.1800256 0.1104536 0.0321181 0.1877139 0.0020304 0.0493639 0.1305689 0.0366315 0.1032607 0.0197673 -0.0244769 0.0099299 -0.022893 -0.1139349 0.0105124 -0.0008681 -0.0348055 0.0901061 0.0530743 0.0121519 -0.0791322 0.0342015 0.0839654 -0.0373256 -0.0552486 0.0033413 -0.1029287 -0.0002242 -0.0432455 0.1209934 -0.0267546 0.0385082 0.0891024 0.0876394 0.0573163 -0.0330292 0.014497 -0.0330917 -0.0398882 -0.0210934 -0.1013125 -0.0942822 -0.0344218 -0.0651133 0.0485688 -0.1484705 -0.089158 0.0429281 -0.1299231 -0.0057779 0.0336498 -0.0041854 0.0136944 0.059264 0.0526542 0.0181128 0.0067909 0.0818122 -0.0591413 -0.1123941 0.053512 -0.0890388 -0.0359238 0.0853911 -0.0507636 0.0202025 0.0148061 -0.142218 0.0317191 0.0287727 -0.0144793 0.0475158 -0.1300403 0.00431 -0.130484 -0.0357968 0.0724033 -0.0241273 -0.1199552 -0.0086722 -0.0368366 0.0209116 0.0366318 -0.0094309 0.054419 0.0657672 -0.0294841 0.0431731 0.0459379 -0.1377309 -0.0171508 -0.0911923 -0.0033984 -0.111404 -0.0258127 -0.0230169 -0.0134987 -0.0308338 0.094865 -0.0113013 -0.024795 -0.0577595 -0.0893132 0.0354223 -0.0247446 -0.1202397 0.01254 -0.0752976 -0.0917235 0.039545 0.0801835 0.049231 0.0463224 -0.0454441 0.0879197 -0.0321778 0.0414802 unknown
polarizability: 127.6770595|1.1908722|98.6908716|-3.4171527|2.9005048|81.7435814 unknown
InChI: InChI=1S/C7H12S2/c1-2-4-7(3-1)8-5-6-9-7/h1-6H2
charge 0 multiplicity 1
21 atoms
S  -0.676722 -1.331724 -0.71885
S  -1.285131 1.608066 0.007673
C  0.125751 0.315251 -0.173097
C  1.201499 0.740017 -1.20213
C  0.923992 0.140633 1.138824
C  2.490472 -0.035666 -0.782692
C  2.238245 -0.544437 0.682386
C  -2.270051 -0.995369 0.233084
C  -2.744896 0.408806 -0.152634
H  1.357626 1.830647 -1.107875
H  0.880211 0.541659 -2.237673
H  0.367333 -0.430555 1.900841
H  1.128928 1.146223 1.557219
H  3.375899 0.622144 -0.837042
H  2.675386 -0.887259 -1.460653
H  2.102595 -1.640404 0.6821
H  3.079844 -0.311261 1.357915
H  -2.070413 -1.074422 1.314631
H  -2.992542 -1.772857 -0.069342
H  -3.104344 0.433932 -1.193248
H  -3.531585 0.772274 0.531161
