program: Gaussian 09
title: 000104375
version: EM64L-G09RevD.01
frameworkgroup: C1[X(C27H19NO4)]
method: RPBEPBE
basis: SDD
operation: Freq
keyword: #p
keyword: freq=noraman
keyword: PBEPBE/SDD
title: #p freq=noraman PBEPBE/SDD
converged: YES YES NO NO
title: Mulliken charges:
elementType: O O O O N C C C C C C C C C C C C C C C C C C C C C C C C C C C H H H H H H H H H H H H H H H H H H H
charge: -0.246865 -0.269804 -0.397834 -0.332849 -0.058826 0.477944 0.333709 -0.481615 0.059308 -0.391195 -0.372908 -0.356742 -0.375478 0.244021 0.033242 0.383344 0.136361 0.172598 -0.524382 -0.379242 -0.346294 0.099184 -0.360710 -0.337096 0.306716 -0.210368 -0.220791 -0.386499 -0.358860 -0.236061 -0.229212 -0.229821 0.219299 0.219107 0.237396 0.240470 0.264803 0.273732 0.281844 0.254472 0.266173 0.255078 0.257277 0.232684 0.231834 0.271723 0.268270 0.232582 0.233732 0.234113 0.382436
chargesum: 0.00000
title: Mulliken charges with hydrogens summed into heavy atoms:
elementType: O O O O N C C C C C C C C C C C C C C C C C C C C C C C C C C C
charge: -0.246865 -0.269804 -0.015398 -0.332849 -0.058826 0.477944 0.333709 -0.043209 0.059308 -0.153799 -0.132439 -0.091939 -0.101746 0.244021 0.033242 0.383344 0.136361 0.172598 -0.242538 -0.124770 -0.080121 0.099184 -0.105632 -0.079818 0.306716 0.022316 0.011043 -0.114777 -0.090590 -0.003479 0.004520 0.004292
polarizability: 6.69428095e+02 3.35078311e+01 2.40697435e+02 -2.32478312e+01 2.14408506e+01 2.07447568e+02
1716.lowfreq: -3.6821 -0.0016 -0.0014 0.0015 1.1114 2.9400 7.6512 10.9696 15.6001
frequency: 3.1604 10.9334 15.5995 42.1238 48.2193 54.1827 58.4922 63.2878 79.9527 101.7220 119.9119 133.1948 138.1090 192.8808 229.5363 235.0191 251.1175 253.5472 264.5031 282.4178 302.1780 306.9986 327.7257 365.9746 394.9361 404.7257 406.1304 417.5905 425.1127 438.9755 460.9503 508.5689 522.4162 526.3332 529.1120 546.6435 572.7802 584.1025 609.8017 612.4685 618.6326 627.3081 634.6660 658.8497 672.8736 679.8874 694.3826 705.7202 726.5538 743.3407 750.1153 756.1314 763.0735 785.3539 787.5100 804.9293 826.0013 847.1962 854.9077 857.9680 860.4740 861.7319 869.5758 869.6708 887.6755 922.6740 938.6180 942.2853 955.0578 963.9020 970.7595 974.4260 981.0358 981.9347 985.9684 987.1674 989.8722 991.5010 1002.1472 1003.0380 1018.6344 1027.1283 1084.3845 1099.1448 1118.5761 1123.0740 1146.2631 1154.0600 1172.8451 1175.0721 1182.1323 1191.3617 1192.3867 1195.0001 1207.7215 1232.1294 1233.8765 1264.5878 1273.7519 1284.3409 1306.2882 1315.1432 1318.0776 1352.9314 1356.1702 1381.0059 1385.2181 1399.0139 1400.6541 1414.7687 1415.0725 1432.4222 1435.0329 1460.1723 1475.9839 1478.4589 1484.7646 1486.7902 1529.9381 1551.8429 1566.6636 1580.1625 1584.8089 1608.5213 1610.5902 1618.7089 1630.0224 1642.9801 2702.2140 2970.7797 3034.4400 3129.3997 3134.7954 3137.4220 3139.0999 3140.2063 3149.8732 3153.8909 3157.2642 3160.9987 3167.2580 3171.0352 3172.3437 3175.0216 3176.6510 3182.0295 3188.9468
redmass: 4.9561 6.0241 6.5615 4.7191 5.7309 4.1663 6.4046 6.6122 5.4807 4.4050 6.8400 7.7045 6.9143 5.1145 6.4631 6.4434 6.2154 6.3315 5.8284 3.8281 6.2545 6.0187 6.5085 2.9569 4.9458 2.8629 2.8747 7.8514 4.1133 3.9155 3.1463 4.9763 5.8665 6.9889 4.0677 6.6259 3.8221 5.4827 7.0596 6.5494 6.6219 5.2746 6.8768 5.4784 3.6260 5.6418 4.7835 1.7380 5.4009 2.7324 2.5659 4.5791 1.6852 1.7276 4.6316 2.3942 2.8461 9.9732 2.2111 1.5905 1.2612 1.4071 1.8021 4.9253 3.0800 4.5659 1.5776 1.3803 1.3258 1.1648 2.6901 3.0013 1.4702 1.3134 1.9676 1.9457 2.9562 1.3814 2.0476 1.3359 2.6656 2.2543 1.5990 1.9247 2.5107 1.3566 1.6330 2.0713 1.8611 1.0551 1.6883 1.1850 1.2274 1.0893 2.4838 2.4588 1.9076 2.9408 3.0014 1.7730 2.1140 1.2965 1.4140 3.2460 1.4469 8.3172 5.4577 4.8362 3.8669 4.4005 3.2348 3.0699 2.3368 2.6768 1.5059 1.6443 3.0590 2.9362 4.5042 6.3434 2.9289 7.0815 5.9057 6.0203 7.5699 7.8975 6.6917 5.1366 1.0720 1.0558 1.1079 1.0851 1.0899 1.0898 1.0883 1.0864 1.0914 1.0894 1.0914 1.0959 1.0953 1.1009 1.0960 1.0958 1.0956 1.0992 1.0927
irintensity: 0.3750 0.1010 0.2738 0.1229 0.0719 0.1939 0.1623 0.8377 0.9274 1.1779 1.2134 2.1009 2.0667 0.4012 0.9471 0.7470 0.7148 0.4710 0.7922 0.6595 2.7635 8.8961 2.1202 2.2820 3.1032 0.1629 0.9399 11.6341 4.6300 2.5297 5.1519 10.3080 8.1949 0.7794 5.3617 1.5492 0.2215 6.1333 0.6351 9.7995 33.7877 4.8318 2.3477 51.1698 12.3593 10.6299 3.7700 62.1369 2.2684 28.2677 34.5793 8.5466 84.1640 10.3977 15.2791 32.2350 31.7096 17.3996 103.6745 48.3653 2.7797 0.8882 39.1696 11.4723 31.1759 6.3237 4.5035 4.0384 5.0435 145.0476 222.0220 34.1328 5.4586 0.1719 11.9054 16.2821 0.3376 0.5663 8.0025 0.9627 1.9050 9.2083 18.6051 8.0293 256.5175 6.3536 4.0035 317.2912 5.5124 0.1889 11.4917 2.1388 27.7422 1.2426 15.6952 22.7967 23.8323 4.5868 610.7632 11.3975 220.7286 1.0452 19.1098 291.9949 121.9513 7.3854 0.6665 6.9451 122.3163 1.9914 18.1590 17.3815 48.1186 4.8830 54.1224 28.2418 61.5857 59.8987 112.1766 30.2918 150.6935 1.4464 3.6823 24.3116 3.9923 2.5397 3.6355 712.1017 440.9412 32.5306 20.7378 0.6976 11.2693 18.7290 5.8764 3.4577 29.3675 1.8303 14.8288 14.9210 4.6716 23.4355 1.2071 10.0588 11.4344 18.0571 0.5015
temp: 298.150 k
press: 1.00000 atm
elementType: 8 8 8 8 7 6 6 6 6 6 6 6 6 6 6 6 6 6 6 6 6 6 6 6 6 6 6 6 6 6 6 6 1 1 1 1 1 1 1 1 1 1 1 1 1 1 1 1 1 1 1
symmnumber: 1
zpe: 1013348.9 jmol-1
zpe.correction: 0.385964 hartree
zpe.thermalcorrener: 0.411483 hartree
zpe.thermalcorrenthalpy: 0.412427 hartree
zpe.thermalcorrgfe: 0.324732 hartree
zpe.sumelectzpe: -1393.745062 hartree
zpe.sumelectthermal: -1393.719544 hartree
zpe.sumelectthermalent: -1393.718599 hartree
zpe.sumelectthermalfe: -1393.806294 hartree
dipole: 1.5604 -5.9783 0.8201
dipole: 6.2328
quadrupole: -144.6188 -188.7428 -180.4124
quadrupole: 26.7638 -16.9265 8.3784
quadrupole: 26.6392 -17.4848 -9.1544 26.7638 -16.9265 8.3784
hfenergy: -1394.1310264 hartree
pointgroup: C01 [X(C27H19N1O4)]
dipole: 0.6106691 -1.3468033 1.9560951 debye
polarizability: 669.8814032|9.2413286|244.1226623|-36.7649932|-18.6837187|203.5690331 unknown
InChI: InChI=1S/C27H19NO4/c29-24-16-21(14-15-22(24)26(30)19-6-2-1-3-7-19)31-17-18-10-12-20(13-11-18)27-28-23-8-4-5-9-25(23)32-27/h1-16,29H,17H2
charge 0 multiplicity 1
51 atoms
O  -0.655998 0.228569 -0.335364
O  6.421422 -1.117473 -0.224081
O  -4.449901 1.362627 -2.968857
O  -6.769084 1.06798 -2.049583
N  6.525475 1.09819 0.467495
C  1.464355 -0.185269 0.755177
C  4.281299 -0.040427 0.40775
C  -0.033143 -0.257267 0.928734
C  5.727726 0.058244 0.243996
C  2.192513 -1.312947 0.300918
C  2.163585 1.017832 1.033152
C  3.588084 -1.248172 0.125899
C  3.556753 1.096061 0.862245
C  7.771721 -0.708843 -0.277309
C  7.831941 0.65083 0.147487
C  -2.050736 0.258489 -0.406762
C  -4.878541 0.364942 -0.758962
C  -3.973707 0.83193 -1.796524
C  -2.577826 0.749631 -1.617895
C  -2.916078 -0.14897 0.656432
C  -4.30138 -0.089311 0.463901
C  -6.323026 0.431381 -1.004301
C  8.890359 -1.453912 -0.666174
C  9.073651 1.31959 0.192236
C  -7.335149 -0.217518 -0.111692
C  10.129491 -0.770338 -0.616132
C  10.218103 0.588162 -0.195582
C  -7.13366 -1.496878 0.474155
C  -8.581554 0.439508 0.072208
C  -8.15312 -2.09322 1.248016
C  -9.59035 -0.149418 0.860689
C  -9.378044 -1.417339 1.453919
H  -0.366467 -1.297011 1.115127
H  -0.372302 0.388384 1.762731
H  1.660846 -2.244877 0.076408
H  1.608589 1.897776 1.378131
H  4.146967 -2.120384 -0.225293
H  4.10401 2.019691 1.074123
H  -1.909591 1.08769 -2.41294
H  -2.519039 -0.492389 1.614617
H  -4.962485 -0.369571 1.289095
H  8.815066 -2.495503 -0.988647
H  9.136368 2.36233 0.515305
H  11.041946 -1.300407 -0.908993
H  11.199234 1.074041 -0.174103
H  -6.204543 -2.044957 0.286725
H  -8.741121 1.406068 -0.416342
H  -7.995593 -3.087478 1.68022
H  -10.542351 0.372175 1.007176
H  -10.165285 -1.87963 2.059779
H  -5.485627 1.405085 -2.87511
