program: Gaussian 09
title: 000104237
version: EM64L-G09RevD.01
frameworkgroup: C1[X(C9H9ClO2)]
method: RPBEPBE
basis: SDD
operation: Freq
keyword: #p
keyword: freq=noraman
keyword: PBEPBE/SDD
title: #p freq=noraman PBEPBE/SDD
converged: YES YES NO NO
title: Mulliken charges:
elementType: Cl O O C C C C C C C C C H H H H H H H H H
charge: -0.086611 -0.257373 -0.214526 0.428162 0.218918 -0.496108 0.401913 -0.331609 -0.371182 -0.753375 -0.212479 -0.532985 0.246045 0.249502 0.264570 0.291364 0.274202 0.166882 0.227261 0.233384 0.254043
chargesum: 0.00000
title: Mulliken charges with hydrogens summed into heavy atoms:
elementType: Cl O O C C C C C C C C C
charge: -0.086611 -0.257373 -0.214526 0.428162 0.218918 -0.250063 0.401913 -0.082106 -0.096980 -0.197441 -0.045597 0.181704
polarizability: 1.71500393e+02 8.80922096e+00 1.23717284e+02 2.51627444e+00 -5.70504311e+00 6.53800312e+01
1716.lowfreq: -9.1886 -5.8975 -0.0013 -0.0010 -0.0005 9.0779 41.4876 70.4285 93.6658
frequency: 41.4505 70.4280 93.6605 121.5320 155.9998 174.4965 220.9909 233.4726 275.9035 320.1736 343.1427 365.3043 451.2177 499.7199 541.2618 567.4558 607.4498 636.8127 727.3278 761.6934 777.1960 831.2193 901.1299 909.6838 944.2715 973.1963 980.6880 998.6723 1100.8700 1111.7298 1140.6248 1153.0665 1183.7346 1228.1226 1251.3229 1255.8083 1296.9979 1358.3165 1407.8983 1428.0806 1438.2396 1453.1991 1468.4785 1470.3079 1495.0856 1573.9127 1610.1174 1623.9104 2871.5639 2976.4915 3072.2392 3079.9800 3117.2707 3139.7604 3148.5196 3167.5301 3172.5900
redmass: 7.8825 6.3373 3.8944 4.7038 5.1104 4.0684 1.2009 2.6770 3.5339 2.9160 4.0442 7.3377 3.8567 3.9617 3.7776 5.5135 6.6407 5.1769 4.7168 3.9544 4.8075 1.4594 1.7024 1.5012 2.9994 1.4485 8.7173 1.6689 1.6303 1.2614 1.1988 1.3586 1.3945 2.2309 2.4077 1.4013 1.7855 1.8358 2.6648 2.7697 1.3202 1.2209 1.0933 1.0520 2.5189 8.2564 6.2562 7.0572 1.0849 1.0323 1.1047 1.0579 1.0916 1.1004 1.0888 1.1108 1.0953
irintensity: 2.3112 0.6266 1.2900 16.4231 6.6953 3.6725 0.2790 1.3726 6.1321 1.3183 4.2555 0.0377 2.8473 27.4696 26.5723 51.7073 19.4708 17.6527 0.6588 10.6494 19.6617 48.1842 4.5985 5.3147 6.0039 2.7018 50.4294 8.1642 55.9818 0.8328 33.8060 28.1690 28.7546 17.6365 163.4973 92.5123 64.0679 9.2988 31.7736 19.4790 0.6621 10.7189 64.0252 16.8430 29.9465 126.5651 326.8542 27.9984 121.8927 56.1621 34.5463 18.1023 6.9461 15.7173 0.1570 1.0725 10.1972
temp: 298.150 k
press: 1.00000 atm
elementType: 17 8 8 6 6 6 6 6 6 6 6 6 1 1 1 1 1 1 1 1 1
symmnumber: 1
zpe: 414633.6 jmol-1
zpe.correction: 0.157926 hartree
zpe.thermalcorrener: 0.169675 hartree
zpe.thermalcorrenthalpy: 0.170619 hartree
zpe.thermalcorrgfe: 0.118952 hartree
zpe.sumelectzpe: -957.968204 hartree
zpe.sumelectthermal: -957.956454 hartree
zpe.sumelectthermalent: -957.955510 hartree
zpe.sumelectthermalfe: -958.007178 hartree
dipole: 2.8397 3.1260 1.7351
dipole: 4.5658
quadrupole: -99.8342 -63.1072 -77.1342
quadrupole: 9.7383 0.4422 -5.9624
quadrupole: -19.8090 16.9180 2.8910 9.7383 0.4422 -5.9624
hfenergy: -958.1261294 hartree
pointgroup: C01 [X(C9H9Cl1O2)]
dipole: 1.310816 1.001072 0.7116019 debye
dipolederiv: -0.4017122 0.2465304 0.0794312 0.2641065 -0.4323445 -0.0984585 0.3177867 -0.3392768 -0.3914307 -1.4900571 -0.7981076 0.0002456 -0.5474261 -0.67788 0.0204914 0.0032876 0.0088023 -0.2790774 -1.318716 -0.0083383 -0.0472235 0.4319259 -0.4152382 0.0427067 -0.1612378 0.0134029 -0.3494253 -0.4292648 -0.0254057 0.0046259 -0.3699601 -0.2569278 -0.0130803 -0.0442746 0.1284863 -0.1442777 1.4034614 0.7206791 0.0366817 0.2353144 0.3001601 0.0082831 0.0648595 0.0334024 0.1124794 0.4847209 0.0260688 0.019905 -0.0795514 0.0605036 -0.0546765 0.0784145 -0.0320452 -0.12517 -1.0158928 -0.1801575 -0.0212765 -0.3312529 -0.401039 0.0299947 -0.0187597 0.0666058 0.0010523 -0.605328 -0.1537879 -0.0121868 0.2384899 0.066957 -0.0223829 -0.0928504 -0.0684219 -0.1806192 0.2478741 0.1327397 0.0280733 0.2448703 0.2014911 -0.0373584 -0.0194684 -0.0482562 -0.0783619 0.4800173 -0.3971578 -0.1628877 -0.3559105 0.5368588 0.159485 -0.283026 0.281412 0.5106071 1.9267666 0.1708728 0.0689306 0.119531 0.6980556 -0.120073 0.1199271 -0.0985173 0.1297743 0.4238951 0.2051124 -0.0222248 0.5045368 0.6912938 -0.0115688 -0.1000877 -0.0610933 0.3066468 0.0894112 -0.0515045 -0.0017981 -0.0272355 -0.0583144 0.0397473 0.0020614 0.0322139 0.132138 0.0684635 -0.0617094 0.0049099 -0.0567991 -0.0654364 0.0365203 0.0032785 0.0405596 0.1557196 0.041736 -0.048505 0.0995265 0.03283 -0.0458729 0.0414683 0.0701233 0.0082995 -0.0288537 -0.0156585 0.0300629 -0.0248436 -0.0359358 0.0694187 -0.0882324 0.0118754 -0.077758 0.0006974 0.0568117 0.0756505 -0.0232732 0.0357485 0.0504963 0.0232903 -0.0127426 0.025421 0.1448267 0.0296931 0.0373997 -0.0131703 -0.1245438 -0.2674361 0.06909 0.0203293 0.0774433 0.0920914 0.0633012 0.0946159 0.0891486 -0.0799947 -0.1025374 -0.0692155 0.0626616 -0.0835413 -0.0265474 0.0853283 0.0403443 -0.0897164 -0.1001764 -0.0327361 0.0354356 -0.0011154 0.0896459 -0.1053099 -0.1248509 -0.0554029 -0.0128775 0.0014329 0.0805276 0.0085336 -0.0210422 0.003215 0.1230401 unknown
polarizability: 173.0186492|1.3251622|122.7597033|-2.0171237|-1.9060911|64.8193555 unknown
InChI: InChI=1S/C9H9ClO2/c1-12-9-3-2-7(6-11)4-8(9)5-10/h2-4,6H,5H2,1H3
charge 0 multiplicity 1
21 atoms
Cl 2.396012 -2.500874 -0.9794
O  2.332115 0.952563 0.167929
O  -4.130243 0.165167 -0.200324
C  0.648238 -0.725309 0.360618
C  0.976211 0.645909 0.111572
C  -0.709151 -1.100321 0.323437
C  -1.734938 -0.15958 0.050668
C  -0.04051 1.599775 -0.164515
C  -1.38386 1.194514 -0.194297
C  1.724124 -1.723623 0.645441
C  -3.148047 -0.594318 0.024845
C  2.755142 2.333317 -0.107096
H  -0.974477 -2.150275 0.504109
H  0.213759 2.645988 -0.354674
H  1.360351 -2.587794 1.21769
H  2.613833 -1.276086 1.104963
H  -2.187232 1.909026 -0.404817
H  -3.306641 -1.684359 0.227301
H  2.326783 3.035869 0.631954
H  2.469071 2.636812 -1.130978
H  3.849958 2.315196 -0.015625
