program: Gaussian 09
title: 000104224
version: EM64L-G09RevD.01
frameworkgroup: C1[X(C13H28O2)]
method: RPBEPBE
basis: SDD
operation: Freq
keyword: #pfreq=noraman
keyword: PBEPBE/SDD
title: #p freq=noraman PBEPBE/SDD
converged: YES YES NO NO
title: Mulliken charges:
elementType: O O C C C C C C C C C C C C C H H H H H H H H H H H H H H H H H H H H H H H H H H H H
charge: -0.275660 -0.274473 -0.388333 -0.382457 -0.372213 -0.382379 -0.357745 -0.372020 -0.441340 -0.353690 0.037344 -0.356401 -0.697064 -0.511174 -0.501965 0.194774 0.195849 0.191063 0.191567 0.183934 0.188555 0.192193 0.192050 0.208904 0.224993 0.188685 0.188575 0.215464 0.196286 0.187588 0.187698 0.173469 0.194314 0.194557 0.214332 0.209772 0.209550 0.197770 0.208620 0.235804 0.192165 0.241827 0.229212
chargesum: 0.00000
title: Mulliken charges with hydrogens summed into heavy atoms:
elementType: O O C C C C C C C C C C C C C
charge: -0.275660 -0.274473 0.002290 0.000173 0.000277 0.001864 0.076152 0.005239 -0.029590 0.021596 0.210813 0.032471 -0.063411 0.131020 0.161239
polarizability: 1.88966645e+02 7.13808344e-01 1.36372765e+02 5.85010379e-01 6.88897902e-01 1.28055605e+02
1716.lowfreq: -9.6390 -5.6614 -0.0013 -0.0002 0.0005 11.3751 20.1314 28.4249 29.9576
frequency: 14.9291 27.9544 29.9009 43.0536 60.3560 69.2018 77.4434 90.0522 106.7767 113.8568 126.9823 136.1401 140.7904 152.7559 167.7989 187.0819 206.3248 224.6753 243.1643 284.3319 289.5195 338.7700 378.2932 396.7329 457.5896 483.1600 507.2153 657.1227 719.5032 722.8478 731.2422 747.1331 775.3718 811.7110 841.4357 872.6640 887.7574 914.2358 967.6270 971.2199 995.4750 1003.1374 1010.0630 1020.2275 1035.0706 1053.7292 1066.0775 1073.2405 1079.6476 1082.7559 1107.2501 1112.3791 1116.3030 1121.8722 1131.4154 1152.0843 1169.8089 1184.0470 1205.8716 1211.3642 1239.9917 1242.2194 1268.0810 1272.5224 1276.1794 1283.9561 1286.9841 1292.7144 1294.5053 1302.7158 1324.3869 1334.6219 1341.4401 1350.0353 1353.2904 1355.4531 1368.0275 1389.2195 1427.8434 1434.4497 1449.4410 1452.7504 1459.3115 1459.3234 1462.7324 1464.4852 1465.0525 1469.8792 1475.4476 1476.3560 1478.1415 1480.5610 1482.3130 1486.9979 1488.6648 2841.2125 2926.5213 2944.2348 2945.5567 2948.2949 2949.6186 2951.6538 2956.3117 2962.2552 2968.0758 2971.2801 2979.2370 2981.0279 2984.2387 2990.3075 2994.1692 3001.5277 3003.1647 3015.4995 3026.1334 3030.0557 3040.2924 3056.9418 3062.9934 3067.9175 3069.3519 3099.0270 3118.0943
redmass: 2.7045 2.0803 3.5936 3.3613 1.7463 2.3697 3.2500 2.6844 1.6406 1.8107 2.5103 2.7175 1.8000 2.0804 1.4959 1.6547 2.7914 1.1278 2.8415 2.9472 3.4237 3.3941 2.9873 3.0401 3.1925 3.0434 4.4628 4.3862 1.0596 1.0712 1.1044 1.2156 1.4303 1.6650 1.8471 1.8161 1.8976 1.4215 1.4485 3.2521 4.3030 4.1103 4.7779 1.2357 3.2813 3.1245 2.7713 2.5131 2.0632 2.2924 1.7191 1.3062 1.3850 2.3792 1.5696 1.4809 1.9289 1.7968 1.3213 1.4911 1.3380 1.3417 1.2558 1.3299 1.0190 1.0448 1.1619 1.0943 1.1228 1.3856 1.4625 1.3938 1.1879 1.5433 1.6957 1.6490 1.5216 1.2179 1.1482 1.1395 1.0724 1.0523 1.0737 1.0729 1.0677 1.0749 1.0675 1.0792 1.0684 1.0508 1.0585 1.0552 1.0815 1.0884 1.0955 1.0825 1.0354 1.0584 1.0404 1.0585 1.0587 1.0592 1.0593 1.0587 1.0582 1.0371 1.0609 1.0957 1.0970 1.0963 1.0650 1.1014 1.1007 1.1037 1.0998 1.1040 1.1046 1.0915 1.1036 1.1006 1.0993 1.0971 1.1027
irintensity: 0.1041 0.4263 0.4291 0.8163 1.2091 0.9849 1.7517 1.4038 0.1270 4.5700 0.3044 1.4694 0.0788 0.0589 5.3930 0.8612 3.2804 0.0016 6.2836 1.8165 1.5258 0.3308 3.7701 0.4935 0.3393 0.5227 3.8716 3.2238 16.1705 0.1263 2.2992 5.0754 8.5729 32.6183 6.9650 11.9467 4.3210 17.1946 2.6980 8.2151 8.7270 4.2243 121.9661 23.6612 19.7211 10.9192 14.0205 6.8000 0.1159 3.1250 17.6470 0.2529 6.2031 31.0908 21.5413 14.0251 36.1755 5.3144 21.4228 2.6872 3.9799 2.6733 1.6448 6.5927 0.4004 1.7075 0.5930 0.1153 0.7227 8.6219 21.6569 4.7919 30.8685 0.7410 0.2500 0.2928 2.5397 11.2929 8.6598 7.4511 2.6398 10.1151 0.0644 0.3703 3.1575 2.5747 6.1702 0.4880 7.4699 6.9273 7.4068 12.0561 1.9534 0.7237 40.3191 99.8771 77.4667 12.7235 85.8398 1.3775 2.7447 0.3496 0.1306 80.8982 164.7710 34.6196 31.3125 2.2924 2.7589 4.8429 42.1425 1.9615 75.5457 7.1960 12.4348 1.5162 173.9649 44.0904 88.6872 101.5218 57.2360 28.7279 25.3051
temp: 298.150 k
press: 1.00000 atm
elementType: 8 8 6 6 6 6 6 6 6 6 6 6 6 6 6 1 1 1 1 1 1 1 1 1 1 1 1 1 1 1 1 1 1 1 1 1 1 1 1 1 1 1 1
symmnumber: 1
zpe: 1018510.3 jmol-1
zpe.correction: 0.387930 hartree
zpe.thermalcorrener: 0.408701 hartree
zpe.thermalcorrenthalpy: 0.409645 hartree
zpe.thermalcorrgfe: 0.334643 hartree
zpe.sumelectzpe: -661.317834 hartree
zpe.sumelectthermal: -661.297063 hartree
zpe.sumelectthermalent: -661.296119 hartree
zpe.sumelectthermalfe: -661.371121 hartree
dipole: -1.7378 1.4767 0.9949
dipole: 2.4881
quadrupole: -81.7986 -92.4122 -98.2406
quadrupole: -5.3349 -3.2264 0.0452
quadrupole: 9.0185 -1.5951 -7.4234 -5.3349 -3.2264 0.0452
hfenergy: -661.7057643 hartree
pointgroup: C01 [X(C13H28O2)]
dipole: -0.6823156 0.5843859 0.3887872 debye
polarizability: 188.9701831|0.6490672|136.3794909|0.4819384|0.6334286|128.0453398 unknown
InChI: InChI=1S/C13H28O2/c1-4-5-6-7-8-9-10-11-12-13(14-2)15-3/h13H,4-12H2,1-3H3
charge 0 multiplicity 1
43 atoms
O  -4.787032 0.74452 -0.883945
O  -4.637273 -1.407398 0.057856
C  0.549172 -0.083292 -0.086945
C  1.90343 0.229479 0.588622
C  -0.670471 0.266536 0.795163
C  3.124716 -0.121666 -0.290654
C  -2.020452 -0.06828 0.123604
C  4.477913 0.176079 0.394347
C  -3.225842 0.280571 1.022362
C  5.701535 -0.17716 -0.480862
C  -4.586998 -0.008926 0.375727
C  7.053352 0.111781 0.211634
C  8.271324 -0.245374 -0.667637
C  -5.245939 2.115522 -0.669553
C  -5.93481 -1.843833 -0.475739
H  0.479481 0.472079 -1.04558
H  0.511471 -1.160986 -0.35016
H  1.940794 1.307176 0.853846
H  1.97038 -0.327813 1.546713
H  -0.638883 1.347882 1.048873
H  -0.591605 -0.280259 1.758839
H  3.064638 0.442721 -1.244848
H  3.081975 -1.197004 -0.563616
H  -2.113142 0.479485 -0.834465
H  -2.060549 -1.145223 -0.125769
H  4.521199 1.251525 0.667454
H  4.53557 -0.388452 1.348768
H  -3.172912 -0.293891 1.968335
H  -3.193532 1.354552 1.297737
H  5.656632 -1.251128 -0.759113
H  5.650118 0.391912 -1.43287
H  -5.428196 0.266825 1.065355
H  7.097574 1.184999 0.488968
H  7.102473 -0.456701 1.162891
H  9.224194 -0.026395 -0.151165
H  8.268496 -1.320222 -0.930541
H  8.259333 0.329574 -1.613054
H  -6.15793 2.146939 -0.034147
H  -4.464031 2.748887 -0.20168
H  -5.483239 2.518842 -1.66683
H  -6.752837 -1.624064 0.24336
H  -6.148944 -1.347239 -1.438145
H  -5.849254 -2.932284 -0.616037
