program: Gaussian 09
title: 000104220
version: EM64L-G09RevD.01
frameworkgroup: C1[X(C17H19N2O2S)]
method: RPBEPBE
basis: SDD
operation: Freq
keyword: #p
keyword: freq=noraman
keyword: PBEPBE/SDD
title: #p freq=noraman PBEPBE/SDD
converged: YES YES NO NO
title: Mulliken charges:
elementType: S O O N N C C C C C C C C C C C C C C C C C H H H H H H H H H H H H H H H H H H H
charge: 0.431471 -0.253604 -0.240249 -0.002129 0.108020 -0.546353 0.505132 0.208197 -0.131016 0.289632 -0.498589 -0.275414 0.431279 -0.211990 -0.213046 -0.253618 -0.362760 -0.362454 -0.256767 -0.787787 -0.666955 -0.666064 0.311152 0.298118 0.267712 0.267599 0.227245 0.227383 0.255299 0.255319 0.238978 0.239016 0.234469 0.234356 0.258328 0.230949 0.243217 0.243162 0.236052 0.243347 0.243365
chargesum: 1.00000
title: Mulliken charges with hydrogens summed into heavy atoms:
elementType: S O O N N C C C C C C C C C C C C C C C C C
charge: 0.431471 -0.253604 -0.240249 -0.002129 0.108020 -0.546353 0.505132 0.208197 0.180136 0.289632 -0.200471 -0.275414 0.431279 0.055722 0.054553 0.201011 -0.107461 -0.107136 0.221227 -0.060635 0.050372 0.056700
polarizability: 3.47196719e+02 -3.50255555e+01 2.87906866e+02 -2.37128502e-01 3.65054972e-01 1.44631339e+02
1716.lowfreq: -32.3047 -4.9774 -2.0315 0.0013 0.0015 0.0017 6.3574 22.4868 31.6878
frequency: -31.8463 22.4388 31.6763 32.6792 36.0509 74.6669 78.4780 89.5203 90.9627 106.7109 113.3774 116.2012 150.9906 175.0973 204.5840 220.1926 236.0147 239.4013 241.6431 259.3138 282.8760 326.0707 357.9540 368.1474 368.4846 381.5561 391.9829 403.5067 427.3947 463.8897 488.6763 514.7572 553.5302 561.8519 606.4763 627.5211 652.0118 665.0540 708.1550 710.6660 725.6422 779.6136 786.0841 818.9468 821.8508 825.2854 844.7521 846.6940 850.2382 876.5347 906.7750 961.2333 981.0686 990.6335 993.2301 1005.2038 1011.7345 1021.1912 1047.0991 1072.4606 1116.1206 1117.1635 1121.5994 1131.4410 1132.7274 1157.2637 1193.2947 1196.5740 1222.1560 1257.2232 1263.5903 1263.6814 1277.7141 1300.0942 1352.1816 1364.2598 1367.1160 1387.6332 1393.4495 1402.5494 1405.2585 1408.2327 1412.3545 1461.7922 1462.4409 1466.7921 1467.3129 1472.1583 1472.7776 1476.9678 1479.8867 1482.5863 1493.5840 1513.8566 1574.0834 1592.4496 1598.2038 2065.8627 2971.7478 2986.4439 2993.6644 3007.3020 3007.4326 3037.7488 3062.9436 3069.0552 3098.9973 3104.2333 3105.0849 3119.1943 3120.0201 3138.0459 3138.9732 3158.9153 3163.2461 3169.4067 3189.3698
redmass: 1.0737 5.0455 4.4769 3.2424 3.8785 3.8090 4.1358 3.9787 4.0806 1.7166 2.0394 7.0786 5.0041 4.8579 4.8611 4.8926 1.3881 1.4152 3.0204 3.9561 4.6370 3.6563 2.8425 8.2261 10.1518 7.3697 6.0104 2.8711 4.2587 4.8435 6.6193 3.2879 7.1541 7.1019 6.0196 6.9699 5.6000 10.0653 4.7821 4.1636 2.3451 4.1542 4.6974 1.1114 1.2279 1.3801 1.4903 3.7437 1.2741 1.4618 4.6430 1.2947 1.3805 1.4050 4.7230 2.7561 2.7549 2.9782 1.6027 2.9690 2.2593 2.2116 1.3262 1.4220 1.4229 3.4470 1.1250 3.3257 3.0798 1.3179 1.1440 1.1422 4.7240 1.2721 1.5506 4.8349 1.4446 3.7363 3.2278 1.2079 1.6623 1.2495 2.2856 1.0384 1.0383 1.3357 1.0956 1.0869 1.0643 2.3106 1.1533 1.0867 2.5038 5.3149 6.1407 6.3670 6.0299 13.9081 1.0552 1.0393 1.0556 1.0372 1.0367 1.1089 1.1093 1.0946 1.1004 1.0986 1.0989 1.1022 1.1027 1.0886 1.0889 1.0966 1.0977 1.0909 1.0928
irintensity: 0.6130 0.0406 0.0431 0.4428 0.7998 0.0245 0.0737 0.5243 1.6100 6.0116 0.1141 0.5569 0.3590 3.6035 0.0160 0.3170 0.3031 1.5354 0.8279 0.0840 0.8689 2.2086 0.4227 0.1203 6.6456 6.1621 8.7706 0.0032 2.2869 11.8971 1.4464 30.1521 0.5061 2.9867 1.3012 0.0498 3.0189 1.2059 3.4007 0.3704 1.6585 32.7797 5.2258 21.4123 13.9724 41.9739 15.6441 0.6670 0.0067 7.6071 143.5135 3.6724 0.0052 0.1758 54.1920 20.8633 117.9999 52.1684 28.5844 7.3116 2.5516 2.0345 9.4409 6.3928 7.0263 16.4114 17.7581 396.6921 10.8780 1.1774 0.3658 1.2448 93.4311 1.0690 116.2132 0.0627 11.1564 17.0369 6.9944 23.3698 52.1603 1.1560 27.9923 16.8419 17.3407 223.2212 17.3554 4.9967 12.9362 53.4332 63.5021 3.1984 200.9711 100.5515 0.6309 265.5059 30.9327 785.2283 20.5082 11.3535 13.7973 6.5729 6.6891 21.1408 11.0694 11.8777 11.8945 8.6524 13.1711 20.0482 21.0149 3.1277 8.0958 6.5326 2.7769 13.2155 2.1853
temp: 298.150 k
press: 1.00000 atm
elementType: 16 8 8 7 7 6 6 6 6 6 6 6 6 6 6 6 6 6 6 6 6 6 1 1 1 1 1 1 1 1 1 1 1 1 1 1 1 1 1 1 1
symmnumber: 1
zpe: 846436.3 jmol-1
zpe.correction: 0.322391 hartree
zpe.thermalcorrener: 0.344689 hartree
zpe.thermalcorrenthalpy: 0.345634 hartree
zpe.thermalcorrgfe: 0.268692 hartree
zpe.sumelectzpe: -1315.329847 hartree
zpe.sumelectthermal: -1315.307548 hartree
zpe.sumelectthermalent: -1315.306604 hartree
zpe.sumelectthermalfe: -1315.383545 hartree
dipole: -2.4119 3.1520 0.0081
dipole: 3.9689
quadrupole: -60.9811 -105.4284 -127.4262
quadrupole: 10.6520 -0.0683 -0.0020
quadrupole: 36.9641 -7.4831 -29.4810 10.6520 -0.0683 -0.0020
hfenergy: -1315.6522374 hartree
pointgroup: C01 [X(C17H19N2O2S1)]
dipole: -1.4662353 0.536436 -0.0251832 debye
polarizability: 361.7015637|11.9724955|273.227367|5.3504326|2.6627783|144.8059926 unknown
InChI: InChI=1S/C17H19N2O2S/c1-4-20-15-11-17(16(21-5-2)10-14(15)19-18)22-13-8-6-12(3)7-9-13/h6-11H,4-5H2,1-3H3
charge 1 multiplicity 1
41 atoms
S  1.55341 -1.810123 0.277758
O  -0.80958 -3.358951 0.197196
O  -2.034929 2.113672 0.259033
N  -4.006758 0.333009 0.184434
N  -5.083004 0.787699 0.167641
C  -0.09448 -1.089603 0.251052
C  -1.19691 -2.036767 0.209995
C  -1.657845 0.797753 0.246219
C  -0.342683 0.300189 0.268747
C  -2.743975 -0.156911 0.205442
C  -2.513331 -1.573532 0.187368
C  2.629305 -0.304383 0.33538
C  4.455237 1.867067 0.428731
C  3.040919 0.206918 1.587055
C  3.120848 0.245276 -0.870305
C  -1.855665 -4.425724 0.159241
C  3.944749 1.2918 1.623788
C  4.024179 1.329886 -0.814277
C  -0.978901 3.185461 0.300414
C  5.465496 2.995913 0.479846
C  -1.126058 -5.761928 0.157737
C  -1.708967 4.52012 0.304214
H  0.507297 0.986227 0.30104
H  -3.364555 -2.256705 0.156428
H  2.675152 -0.24009 2.517205
H  2.816925 -0.17185 -1.835901
H  -2.501394 -4.309757 1.052533
H  -2.460319 -4.285418 -0.758942
H  4.269671 1.684545 2.593806
H  4.410981 1.752313 -1.748461
H  -0.379653 3.033614 1.217954
H  -0.337343 3.062327 -0.59253
H  5.396519 3.648929 -0.406855
H  5.337342 3.619875 1.380706
H  6.495924 2.592386 0.507305
H  -1.863555 -6.583635 0.128694
H  -0.471367 -5.854053 -0.724385
H  -0.513423 -5.879472 1.066617
H  -0.968171 5.339017 0.332031
H  -2.321139 4.643064 -0.604355
H  -2.360048 4.617139 1.188499
