program: Gaussian 09
title: 000104253
version: EM64L-G09RevD.01
frameworkgroup: C1[X(C11H10Cl2N4O6S2)]
method: RPBEPBE
basis: SDD
operation: Freq
keyword: #p
keyword: freq=noraman
keyword: PBEPBE/SDD
title: #p freq=noraman PBEPBE/SDD
converged: NO YES NO NO
title: Mulliken charges:
elementType: Cl Cl S S O O O O O O N N N N C C C C C C C C C C C H H H H H H H H H H
charge: 0.059497 0.054063 0.879096 1.189858 -0.384863 -0.602328 -0.504844 -0.539337 -0.493039 -0.462097 -0.409556 -0.020948 -0.002698 0.128745 -0.499414 -0.060680 -0.293254 -0.205482 -0.261976 0.478371 -0.428404 -0.295263 0.129172 -0.266933 -0.232243 0.264217 0.289856 0.294301 0.259397 0.300002 0.289972 0.248531 0.331262 0.354834 0.412182
chargesum: 0.00000
title: Mulliken charges with hydrogens summed into heavy atoms:
elementType: Cl Cl S S O O O O O O N N N N C C C C C C C C C C C
charge: 0.059497 0.054063 0.879096 1.189858 -0.384863 -0.602328 -0.504844 -0.127155 -0.493039 -0.462097 -0.054722 -0.020948 -0.002698 0.128745 0.054659 -0.060680 0.260445 0.094520 0.027996 0.478371 -0.179873 0.035999 0.129172 -0.266933 -0.232243
polarizability: 4.58454395e+02 1.62833751e+00 2.40144565e+02 -4.21486198e+00 -1.10976035e+00 1.30529423e+02
1716.lowfreq: -4.3137 -0.0015 -0.0014 0.0012 3.3926 5.4366 13.3213 19.1482 22.0228
frequency: 13.1776 19.1088 22.0212 42.9556 54.4475 56.9907 60.6824 74.3760 116.1759 124.3805 130.3779 142.0642 150.0787 168.9757 174.2914 200.3955 210.7915 211.2202 228.3044 237.9922 253.7827 280.2940 301.9102 315.8065 328.7457 344.4507 361.4322 377.3950 385.5204 397.9418 411.0261 415.5356 434.5139 447.9037 470.5666 504.7375 521.3275 551.9985 611.6448 621.6672 634.1095 638.2236 648.3207 691.4487 719.7169 732.3311 761.3761 784.8621 795.4613 822.8054 840.0976 841.9782 858.1117 867.9511 870.3844 882.9589 893.1594 924.4761 959.3286 968.0763 973.9320 989.3436 998.9587 1003.9650 1047.6061 1055.4575 1122.9019 1154.9692 1157.1358 1188.7442 1192.7727 1205.8195 1250.1303 1257.3306 1262.3399 1300.7320 1334.9652 1340.8564 1376.5353 1384.6071 1400.2161 1411.0913 1440.6492 1446.1999 1480.4834 1497.7073 1558.0128 1599.6861 1603.4838 2324.3057 2950.2063 3014.8751 3046.9301 3134.8092 3143.0903 3153.8352 3170.0942 3195.0455 3509.7140
redmass: 10.3528 14.2043 10.3495 10.9045 11.5265 4.5673 10.0137 8.4616 9.3044 8.9278 11.2566 12.7312 9.8138 12.4343 13.5001 10.7056 8.6732 7.1615 4.9249 6.2275 6.9688 4.7683 7.9672 6.5005 7.2243 14.0208 5.7929 4.6355 10.3784 10.2101 5.6014 3.4408 11.6646 8.3383 6.1704 4.1847 4.7257 5.1063 7.3763 11.9896 11.2255 9.7458 4.0806 8.4429 2.9225 1.7314 10.9357 9.3311 7.1564 2.5793 4.9656 1.4835 6.2002 1.3321 1.2961 13.4427 6.6664 1.8121 5.3880 1.4680 3.3136 5.0825 14.8240 1.3246 3.0210 2.4543 1.4197 1.2440 3.9345 1.1776 7.9273 1.1312 3.9571 4.8537 1.1884 1.4365 1.2326 3.6415 1.1091 1.0790 8.2735 3.4762 1.0625 5.5449 2.9146 3.2635 4.0017 5.2343 4.9555 1.0836 1.0600 1.0997 1.0577 1.0907 1.1099 1.0916 1.0957 1.0952 1.0756
irintensity: 2.8049 0.3521 2.6622 0.5637 1.4421 0.2369 0.2326 2.1435 11.8916 9.1251 1.2579 0.4185 0.2020 0.4517 0.0974 4.3730 1.9725 3.0634 4.8365 7.6425 1.4621 1.5619 9.6564 13.8829 34.8761 24.5505 5.6314 14.0448 40.6667 2.7429 9.6566 3.5947 12.6595 46.2921 43.2426 49.3729 4.2879 100.5314 5.5470 0.0217 18.2525 119.0855 7.5925 22.0532 16.9032 28.7901 258.2094 80.1002 21.0650 4.0741 54.2168 29.5979 64.5204 30.2923 218.9835 3.7103 71.5313 68.3534 36.4733 1.4461 110.6149 4.0128 144.9980 1.5725 44.8765 71.2072 24.7929 9.8459 52.6025 9.5798 397.0670 3.2521 148.4470 13.5220 6.4016 35.3011 14.6450 323.8683 23.8768 64.4359 112.9246 5.2690 32.7184 657.2199 101.4575 891.9376 921.6646 180.2356 61.0347 3194.2376 17.6707 2.5551 9.3162 7.1722 0.2899 4.1363 9.1890 19.7521 53.8105
temp: 298.150 k
press: 1.00000 atm
elementType: 17 17 16 16 8 8 8 8 8 8 7 7 7 7 6 6 6 6 6 6 6 6 6 6 6 1 1 1 1 1 1 1 1 1 1
symmnumber: 1
zpe: 565784.2 jmol-1
zpe.correction: 0.215496 hartree
zpe.thermalcorrener: 0.240593 hartree
zpe.thermalcorrenthalpy: 0.241538 hartree
zpe.thermalcorrgfe: 0.156557 hartree
zpe.sumelectzpe: -2809.561441 hartree
zpe.sumelectthermal: -2809.536343 hartree
zpe.sumelectthermalent: -2809.535399 hartree
zpe.sumelectthermalfe: -2809.620380 hartree
dipole: -8.3421 -0.8546 4.3865
dipole: 9.4637
quadrupole: -274.6159 -172.5698 -175.5142
quadrupole: 17.0632 15.4871 6.9937
quadrupole: -67.0493 34.9969 32.0525 17.0632 15.4871 6.9937
hfenergy: -2809.7769368 hartree
pointgroup: C01 [X(C11H10Cl2N4O6S2)]
dipole: -3.3254923 -0.259771 -1.654286 debye
polarizability: 458.4613759|1.5028224|228.7225797|-3.7168345|-33.5399153|141.9444274 unknown
InChI: InChI=1S/C11H10Cl2N4O6S2/c12-9-15-10(13)17-11(16-9)14-7-1-3-8(4-2-7)24(18,19)6-5-23-25(20,21)22/h1-4,14,20H,5-6H2
charge 0 multiplicity 1
35 atoms
Cl -8.029666 1.530533 -0.445681
Cl -5.564083 -2.910513 1.294271
S  2.815384 -0.200037 0.474086
S  6.877082 0.321661 -0.089431
O  5.70268 -0.26988 -1.490302
O  3.552012 1.285295 0.586714
O  2.965007 -1.310809 1.655512
O  6.034467 1.771028 0.406166
O  6.826398 -0.833939 1.038003
O  8.235706 0.754564 -0.799367
N  -3.046334 1.234418 -0.219579
N  -4.241045 -0.719536 0.49622
N  -5.361016 1.295161 -0.294862
N  -6.661234 -0.623787 0.40324
C  3.397818 -1.052281 -1.188596
C  1.000886 0.221276 0.236759
C  4.877089 -1.425671 -1.1388
C  0.660939 1.491417 -0.25913
C  0.051203 -0.736877 0.626504
C  -1.698205 0.837085 -0.039688
C  -0.704907 1.793713 -0.398728
C  -1.316624 -0.430535 0.481941
C  -4.224098 0.564782 0.009113
C  -6.51411 0.644683 -0.074915
C  -5.479354 -1.231934 0.660669
H  2.733708 -1.931325 -1.243456
H  3.169557 -0.310553 -1.969742
H  5.16942 -1.850969 -0.153659
H  5.062802 -2.202887 -1.906988
H  1.437718 2.225051 -0.494766
H  0.365368 -1.691334 1.062235
H  -1.000565 2.778354 -0.779535
H  -2.084945 -1.148766 0.770361
H  -3.205364 2.180314 -0.582184
H  4.996405 1.541998 0.534115
