program: Gaussian 09
title: 000104182
version: EM64L-G09RevD.01
frameworkgroup: C1[X(C17H19N)]
method: RPBEPBE
basis: SDD
operation: Freq
keyword: #pfreq=noraman
keyword: PBEPBE/SDD
title: #p freq=noraman PBEPBE/SDD
converged: NO YES NO NO
title: Mulliken charges:
elementType: N C C C C C C C C C C C C C C C C C H H H H H H H H H H H H H H H H H H H
charge: -0.358620 -0.342976 -0.207289 -0.450994 -0.461905 0.202683 0.278399 0.519357 -0.370069 -0.405997 -0.473421 -0.378377 -0.250693 -0.261924 -0.641796 -0.227309 -0.240851 -0.250820 0.224803 0.206537 0.216192 0.246629 0.208855 0.201662 0.281731 0.250187 0.241162 0.232261 0.248169 0.226758 0.226300 0.222520 0.191806 0.226235 0.222664 0.222437 0.225693
chargesum: 0.00000
title: Mulliken charges with hydrogens summed into heavy atoms:
elementType: N C C C C C C C C C C C C C C C C C
charge: -0.076890 -0.118173 -0.000753 0.011828 -0.051388 0.202683 0.278399 0.519357 -0.119882 -0.164834 -0.241160 -0.130208 -0.023935 -0.035623 -0.001235 -0.004645 -0.018414 -0.025126
polarizability: 2.30539615e+02 -9.33961889e-01 1.69616442e+02 5.78553799e+00 5.74876578e+00 1.46084710e+02
1716.lowfreq: -11.4598 -10.7171 -0.0004 0.0003 0.0004 8.0979 28.4637 32.6345 63.6929
frequency: 28.2618 32.6100 63.6869 83.0433 98.3350 128.7494 189.1692 196.8247 233.5599 246.2570 280.1170 293.1571 317.2650 367.9441 381.7426 404.4036 422.4031 467.2426 507.9705 533.3812 544.4027 597.9318 616.3422 622.8770 627.3519 664.0655 706.9614 731.0422 754.8598 766.9991 786.5562 810.6132 831.4741 855.1632 872.5500 883.9734 900.6722 928.1439 949.9254 962.2344 976.6407 989.7459 990.4762 993.0770 1005.1918 1026.7900 1037.5785 1055.0449 1074.5868 1081.8387 1101.1227 1113.0380 1129.2700 1149.0404 1167.9960 1170.6776 1176.7092 1186.2056 1187.6005 1201.2625 1212.1360 1215.7096 1260.3492 1267.6594 1299.6925 1314.6843 1322.1397 1331.3834 1344.8303 1358.2755 1377.9148 1383.0209 1431.7897 1433.5009 1441.1361 1449.0374 1460.7830 1462.7330 1472.5004 1481.3239 1484.3934 1495.0094 1583.6377 1592.5358 1609.7296 1612.7645 2842.0119 2869.1442 2939.6928 2983.6686 2998.5309 3017.6945 3041.3856 3060.3410 3076.0890 3105.5935 3110.5629 3118.2855 3121.9814 3131.0171 3137.3007 3142.1032 3157.8124 3160.1066 3464.1841
redmass: 3.9275 3.8454 4.1842 2.8892 3.3509 2.3869 2.0132 2.1998 3.0422 3.6106 2.2300 3.7752 3.6741 3.0591 3.2229 2.8240 3.4162 3.6337 2.7259 3.2171 3.0517 3.6402 5.5282 2.9885 2.5698 3.0324 1.6856 2.7565 2.4382 1.7678 2.0546 3.4503 2.6544 1.2487 2.5316 1.4770 1.9301 1.6101 1.8409 1.6595 1.3853 1.4954 4.0380 1.3184 2.1603 2.1701 2.4280 2.4229 1.7311 1.6678 1.5429 1.6229 3.1652 1.4325 1.4084 1.0630 1.1479 1.4204 1.5489 1.8905 1.8421 1.6113 1.7511 1.5129 1.4252 1.2709 1.5447 1.3001 1.4105 1.4540 6.9489 7.3730 1.8017 1.2065 2.1678 1.2980 1.0849 1.1394 1.0970 2.2972 2.3467 1.0480 7.0122 6.1332 6.2121 6.1609 1.0817 1.0562 1.0820 1.0618 1.0614 1.0748 1.0986 1.1029 1.0993 1.0877 1.0873 1.0859 1.0870 1.0910 1.0931 1.0959 1.1004 1.1014 1.0753
irintensity: 0.1542 0.1254 0.3678 0.3250 0.5751 0.6010 1.6851 0.4894 0.5647 1.9604 2.5590 1.3690 3.0304 1.0523 1.3393 0.0926 0.3743 2.9817 16.2539 15.0977 20.6745 7.7930 2.1750 27.3951 17.7194 20.7809 53.0723 21.2059 16.2043 56.9418 24.5744 3.6657 1.7577 0.0204 1.0317 0.3881 4.7069 0.7254 10.3470 4.3212 0.0442 0.5880 0.1355 0.2639 2.7350 8.0257 7.0242 4.2207 1.7801 4.3744 0.2039 3.8988 58.8517 0.6181 4.0115 0.2857 0.3819 1.0963 1.9148 2.4550 6.3700 2.0592 1.1652 0.3028 7.0623 12.3068 2.1928 3.0525 3.8949 4.0188 0.4958 0.6356 14.9989 0.5826 8.0795 17.2309 9.4449 3.5991 6.5393 16.8081 34.5264 18.8167 2.0572 0.9013 7.5659 6.8361 80.3919 175.8481 18.1912 52.9933 30.2591 42.3295 57.9239 24.3717 30.2423 13.3298 9.3360 2.1235 2.4183 13.4964 26.4240 42.8154 34.1672 28.4474 0.3879
temp: 298.150 k
press: 1.00000 atm
elementType: 7 6 6 6 6 6 6 6 6 6 6 6 6 6 6 6 6 6 1 1 1 1 1 1 1 1 1 1 1 1 1 1 1 1 1 1 1
symmnumber: 1
zpe: 823511.3 jmol-1
zpe.correction: 0.313659 hartree
zpe.thermalcorrener: 0.329248 hartree
zpe.thermalcorrenthalpy: 0.330193 hartree
zpe.thermalcorrgfe: 0.269828 hartree
zpe.sumelectzpe: -712.659121 hartree
zpe.sumelectthermal: -712.643531 hartree
zpe.sumelectthermalent: -712.642587 hartree
zpe.sumelectthermalfe: -712.702952 hartree
dipole: 1.1552 -0.0404 0.0225
dipole: 1.1562
quadrupole: -95.8201 -106.6405 -102.9821
quadrupole: -2.1143 3.3534 1.6160
quadrupole: 5.9942 -4.8263 -1.1679 -2.1143 3.3534 1.6160
hfenergy: -712.9727796 hartree
pointgroup: C01 [X(C17H19N1)]
dipole: -0.4506464 0.0585968 0.0198366 debye
polarizability: 229.5693429|-6.3510727|170.9148117|-8.0661807|-3.4666358|145.7566123 unknown
InChI: InChI=1S/C17H19N/c1-18-17-12-11-14(13-7-3-2-4-8-13)15-9-5-6-10-16(15)17/h2-10,14,17-18H,11-12H2,1H3
charge 0 multiplicity 1
37 atoms
N  -2.478303 1.646167 1.084378
C  0.444046 0.382929 -0.991236
C  -2.443182 1.09871 -0.302656
C  -0.075219 1.833979 -0.781993
C  -1.545711 1.969479 -1.21389
C  -0.574871 -0.67176 -0.521262
C  -1.932395 -0.34123 -0.250018
C  1.828606 0.216844 -0.359361
C  -0.17402 -2.030611 -0.424607
C  -2.843555 -1.368516 0.106841
C  2.989613 0.122589 -1.165765
C  1.982202 0.205574 1.052319
C  -1.084415 -3.04456 -0.063462
C  -2.433989 -2.714034 0.203951
C  -3.344006 2.822285 1.283783
C  4.274788 0.021068 -0.582753
C  3.261373 0.102191 1.638838
C  4.415086 0.010465 0.823106
H  0.562824 0.234075 -2.08707
H  -3.476772 1.084706 -0.734467
H  0.574214 2.531338 -1.343264
H  -0.006783 2.101126 0.288725
H  -1.865911 3.026946 -1.160192
H  -1.67464 1.643854 -2.266083
H  -2.655975 0.903018 1.771324
H  0.871717 -2.289003 -0.628799
H  -3.892395 -1.103833 0.296547
H  2.886518 0.129603 -2.25862
H  1.091152 0.270442 1.688546
H  -0.746989 -4.085014 0.004844
H  -3.153631 -3.494306 0.475742
H  -3.382639 3.072247 2.358815
H  -4.39184 2.680398 0.919227
H  -2.927875 3.701477 0.758967
H  5.161277 -0.051184 -1.223438
H  3.362035 0.093176 2.730409
H  5.408666 -0.069933 1.278577
