program: Gaussian 09
title: 000104174
version: EM64L-G09RevD.01
frameworkgroup: C1[X(C11H18O2)]
method: RPBEPBE
basis: SDD
operation: Freq
keyword: #pfreq=noraman
keyword: PBEPBE/SDD
title: #p freq=noraman PBEPBE/SDD
converged: NO YES NO NO
title: Mulliken charges:
elementType: O O C C C C C C C C C C C H H H H H H H H H H H H H H H H H H
charge: -0.307299 -0.223733 0.014076 -0.130910 -0.423926 -0.420567 -0.460891 -0.454600 -0.745145 0.175167 0.482561 -0.777062 -0.669405 0.199623 0.248076 0.189785 0.201580 0.202745 0.189813 0.226043 0.205055 0.212927 0.220808 0.207423 0.214217 0.214258 0.227688 0.279219 0.231270 0.238157 0.233046
chargesum: 0.00000
title: Mulliken charges with hydrogens summed into heavy atoms:
elementType: O O C C C C C C C C C C C
charge: -0.307299 -0.223733 0.213700 0.117166 -0.032561 -0.028009 -0.029793 -0.020865 -0.109247 0.175167 0.482561 -0.038885 -0.198203
polarizability: 1.60983619e+02 9.14585286e+00 1.19118034e+02 -1.20252641e+00 -2.68293448e+00 9.39252082e+01
1716.lowfreq: -6.5108 -0.0008 -0.0004 0.0005 11.2619 15.0135 20.2942 44.5702 57.0088
frequency: 18.3536 44.3695 56.9458 80.1680 150.2139 171.8000 199.0424 204.8902 219.3590 228.2610 235.7977 301.2976 313.9840 386.2664 411.8280 422.6573 452.3438 466.7686 488.1488 524.0387 662.2511 704.3191 752.3005 767.4991 775.7706 786.0605 836.7453 886.6966 898.8524 917.0072 918.9117 941.4072 960.6110 977.2258 1005.7580 1007.4303 1045.8714 1058.9180 1061.6162 1078.5004 1093.2618 1102.4855 1148.5045 1166.8308 1220.2754 1223.7404 1246.3998 1250.5672 1293.2248 1303.5863 1308.6378 1312.6721 1324.3603 1341.8182 1352.9194 1362.8111 1384.7171 1389.8845 1407.6479 1452.9866 1456.4483 1463.1114 1466.3140 1473.4279 1475.3884 1476.4144 1478.9301 1648.5594 1684.5554 2946.0035 2956.4401 2962.5445 2966.9949 2981.9962 2985.2231 2989.4202 3016.8461 3019.9486 3026.4437 3044.1616 3054.1514 3060.5400 3065.9915 3078.0915 3108.8632 3123.7100 3236.2387
redmass: 3.6275 3.2901 3.5262 4.3757 3.7451 3.4809 1.3506 1.1193 2.0584 1.8554 3.4516 2.4020 3.0982 2.5086 2.2190 2.5364 3.1004 3.0033 2.6919 2.3036 2.1806 4.0058 2.2297 2.6411 3.8619 1.4825 2.1442 1.6680 2.3359 1.3485 1.4514 1.9975 1.3886 3.2431 1.5074 1.7002 2.2314 1.5121 1.1360 3.6289 2.1510 2.5481 2.4229 1.9281 2.6079 1.3747 1.3324 1.3802 1.3697 1.2595 1.3258 1.2883 1.3364 1.4974 1.7137 1.5606 1.2189 1.1703 1.2352 1.0468 1.0851 1.0856 1.0863 1.0835 1.0519 1.0598 1.0571 9.9869 5.8088 1.0790 1.0617 1.0562 1.0448 1.0608 1.0619 1.0372 1.0862 1.0974 1.0987 1.1036 1.1010 1.0990 1.0993 1.0963 1.1000 1.0631 1.1157
irintensity: 0.5481 0.5373 0.4446 0.0800 2.8305 2.5281 1.4622 0.0436 0.3345 0.4795 5.7870 0.6707 2.6821 2.3858 1.3534 5.1503 0.9472 1.7449 3.9183 2.4746 6.0148 6.7014 1.2686 0.2205 2.4486 0.0178 4.9146 3.7459 11.2860 86.2672 8.3814 10.4998 1.4259 132.7851 6.1691 4.8924 4.5775 6.9274 4.1921 413.3139 20.6242 0.3948 48.3065 9.3029 111.1494 2.7976 4.4349 0.7974 2.4655 3.0500 35.7241 15.8111 1.2754 1.4646 22.7884 2.6779 14.0396 31.9818 13.9192 23.4866 1.1561 9.8726 11.3891 14.2532 14.3587 7.9161 24.5417 150.1652 87.1723 2.8906 24.1803 21.0766 94.7292 22.5728 12.3165 16.8355 2.8491 63.8536 24.8812 11.9004 36.2689 101.6571 41.8804 11.7787 17.1368 0.3304 10.3475
temp: 298.150 k
press: 1.00000 atm
elementType: 8 8 6 6 6 6 6 6 6 6 6 6 6 1 1 1 1 1 1 1 1 1 1 1 1 1 1 1 1 1 1
symmnumber: 1
zpe: 701935.0 jmol-1
zpe.correction: 0.267353 hartree
zpe.thermalcorrener: 0.281621 hartree
zpe.thermalcorrenthalpy: 0.282565 hartree
zpe.thermalcorrgfe: 0.225208 hartree
zpe.sumelectzpe: -579.380163 hartree
zpe.sumelectthermal: -579.365895 hartree
zpe.sumelectthermalent: -579.364951 hartree
zpe.sumelectthermalfe: -579.422308 hartree
dipole: -0.6185 0.2468 -1.2938
dipole: 1.4551
quadrupole: -71.6025 -77.8714 -84.9038
quadrupole: -0.4156 -2.5239 2.6868
quadrupole: 6.5234 0.2545 -6.7779 -0.4156 -2.5239 2.6868
hfenergy: -579.647516 hartree
pointgroup: C01 [X(C11H18O2)]
dipole: 0.2452961 0.0939794 0.5086637 debye
polarizability: 160.9587399|-9.1621096|119.1011314|-1.4990033|2.8622373|93.9669897 unknown
InChI: InChI=1S/C11H18O2/c1-8(2)13-11(12)10-6-4-9(3)5-7-10/h9-10H,1,4-7H2,2-3H3
charge 0 multiplicity 1
31 atoms
O  -2.0030 0.365358 0.586613
O  -1.389475 -0.785135 -1.368986
C  3.32925 0.00411 -0.21649
C  0.344886 -0.022442 0.219158
C  2.623245 -1.116731 0.588195
C  2.497989 1.309953 -0.141342
C  1.162977 -1.338688 0.132969
C  1.040898 1.101762 -0.610842
C  4.776425 0.22573 0.270235
C  -1.067354 -0.224184 -0.300677
C  -3.423576 0.288129 0.323249
C  -3.99372 -1.098819 0.16544
C  -4.106905 1.45475 0.352604
H  3.360955 -0.313964 -1.28178
H  0.279613 0.309503 1.272069
H  2.640022 -0.847896 1.665892
H  3.189445 -2.063818 0.48877
H  2.976565 2.097035 -0.757051
H  2.501334 1.678411 0.906522
H  1.139082 -1.701287 -0.912967
H  0.686281 -2.120265 0.755955
H  0.469203 2.044732 -0.517368
H  1.027844 0.811597 -1.680046
H  4.788964 0.549757 1.329174
H  5.372303 -0.703243 0.195528
H  5.286826 1.005123 -0.326211
H  -5.094361 -1.052561 0.131224
H  -3.622845 -1.571306 -0.759972
H  -3.69539 -1.739751 1.016302
H  -3.593398 2.410196 0.490751
H  -5.194283 1.461246 0.241884
