program: Gaussian 09
title: 000104189
version: EM64L-G09RevD.01
frameworkgroup: C1[X(C9H11NO6S)]
method: RPBEPBE
basis: SDD
operation: Freq
keyword: #p
keyword: freq=noraman
keyword: PBEPBE/SDD
title: #p freq=noraman PBEPBE/SDD
converged: YES YES NO NO
title: Mulliken charges:
elementType: S O O O O O O N C C C C C C C C C H H H H H H H H H H H
charge: 0.905194 -0.527643 -0.562672 -0.238828 -0.429010 -0.183329 -0.202368 0.007265 -0.097667 -0.578167 -0.334765 -0.235456 -0.289003 0.286147 0.235904 -0.299229 -0.525935 0.259310 0.317233 0.329462 0.297227 0.213515 0.241735 0.278214 0.372969 0.226842 0.247069 0.285987
chargesum: 0.00000
title: Mulliken charges with hydrogens summed into heavy atoms:
elementType: S O O O O O O N C C C C C C C C C
charge: 0.905194 -0.527643 -0.562672 -0.238828 -0.056041 -0.183329 -0.202368 0.007265 -0.097667 -0.001623 -0.005303 0.061770 0.166247 0.286147 0.235904 -0.021015 0.233964
polarizability: 2.16135648e+02 4.81778840e-02 1.61711392e+02 -1.77277113e+00 -4.41830215e+00 1.02408008e+02
1716.lowfreq: -6.2707 -0.0021 -0.0013 -0.0010 2.0783 6.9227 23.1921 30.7791 49.7165
frequency: 23.1234 30.6015 49.6600 77.5326 98.9873 103.8534 140.6849 155.7344 179.2787 183.7574 191.3639 209.0918 234.9154 253.8021 276.8740 289.4675 323.3400 364.8271 373.8534 389.9100 401.9229 457.1178 468.4106 513.7392 531.5366 568.7067 611.7951 642.5887 672.0689 690.2601 734.0022 738.7081 761.2493 820.8546 836.2026 844.3250 898.6599 921.6165 926.3932 958.9985 978.3972 1003.1447 1036.0624 1065.9314 1070.8023 1106.5771 1137.1448 1139.3943 1152.3634 1180.5543 1205.6618 1237.3889 1252.3533 1257.9576 1346.6646 1351.5869 1375.9998 1385.4854 1404.7540 1407.5050 1426.2344 1453.4121 1454.5255 1464.2484 1469.7468 1565.1709 1598.3209 2944.8799 2992.3231 3037.7611 3047.0087 3106.3212 3137.9680 3141.0361 3156.0594 3159.5708 3180.8552 3342.2081
redmass: 5.9551 8.8734 4.8101 6.2847 8.5227 4.0505 4.3611 4.3096 3.6545 1.8281 4.2950 7.6433 5.1062 4.0460 2.9630 7.7906 5.4712 5.4762 4.7274 9.3396 5.2164 3.3684 4.1530 4.9292 4.3120 4.8763 6.4691 7.8017 1.1655 6.1020 5.5887 6.1623 11.9264 6.7146 2.1181 1.5648 2.7528 2.8598 1.5775 8.1608 1.3396 1.9805 2.9978 1.9509 5.4878 1.2493 1.4388 1.2376 1.3056 1.1489 9.0779 1.7338 1.9953 1.3696 1.2847 5.3806 5.0125 1.1073 1.1661 5.3704 1.5043 1.0944 1.0754 1.5149 1.2671 8.2921 7.0365 1.0682 1.0321 1.0667 1.0824 1.1010 1.1099 1.1055 1.0898 1.0922 1.0963 1.0662
irintensity: 1.5980 0.3645 0.4325 5.4581 2.5954 6.8398 6.0203 5.2873 4.8501 4.7315 0.3681 4.0151 8.5521 0.9608 3.9311 13.1528 3.4510 29.7993 15.8401 19.5797 5.8882 6.1169 13.2560 11.6885 24.6898 50.3367 0.8447 15.4803 135.7482 1.4472 0.8987 11.8176 60.4404 5.6723 23.3248 32.3054 54.8321 92.5673 20.3472 37.0287 1.8802 52.7658 75.8474 61.5224 1.4502 1.6572 27.3390 3.1795 11.3034 39.5359 190.5081 40.3082 162.8575 31.6889 1.6046 62.7483 27.8137 16.6313 107.8563 47.6656 28.4191 37.3306 7.2195 110.0944 4.1006 39.2335 71.1045 53.9603 33.0532 8.0114 11.0338 14.1528 1.5714 16.8962 2.9984 14.8363 2.0481 96.9368
temp: 298.150 k
press: 1.00000 atm
elementType: 16 8 8 8 8 8 8 7 6 6 6 6 6 6 6 6 6 1 1 1 1 1 1 1 1 1 1 1
symmnumber: 1
zpe: 518719.9 jmol-1
zpe.correction: 0.197570 hartree
zpe.thermalcorrener: 0.215155 hartree
zpe.thermalcorrenthalpy: 0.216099 hartree
zpe.thermalcorrgfe: 0.150686 hartree
zpe.sumelectzpe: -1252.140854 hartree
zpe.sumelectthermal: -1252.123269 hartree
zpe.sumelectthermalent: -1252.122325 hartree
zpe.sumelectthermalfe: -1252.187737 hartree
dipole: -4.0138 -3.5614 6.1889
dipole: 8.1912
quadrupole: -115.0027 -120.1666 -107.2253
quadrupole: 1.1918 1.1908 -3.4912
quadrupole: -0.8712 -6.0351 6.9063 1.1918 1.1908 -3.4912
hfenergy: -1252.3384237 hartree
pointgroup: C01 [X(C9H11N1O6S1)]
dipole: -1.4408383 2.1117957 -1.9621382 debye
polarizability: 215.4733929|-2.016314|158.4791711|8.6129791|14.0850799|106.3024837 unknown
InChI: InChI=1S/C9H11NO6S/c1-16-9-3-2-7(6-8(9)10(12)13)17(14,15)5-4-11/h2-3,6,11H,4-5H2,1H3
charge 0 multiplicity 1
28 atoms
S  2.664948 0.4897 0.792169
O  3.111049 1.722125 1.766277
O  2.844129 -1.098249 1.218096
O  -3.210833 1.42602 -0.387315
O  4.380528 -1.66447 -1.050867
O  -1.542258 -2.51075 -0.756658
O  -3.284051 -1.519312 0.340669
N  -2.106058 -1.494057 -0.195493
C  0.828502 0.715757 0.417875
C  3.598642 0.685234 -0.915322
C  0.063075 -0.411479 0.129047
C  0.274273 2.008132 0.542531
C  3.561924 -0.64313 -1.680098
C  -1.327691 -0.24481 -0.085247
C  -1.920019 1.059956 -0.071225
C  -1.09311 2.166794 0.285609
C  -4.087773 0.62226 -1.266164
H  3.086855 1.526206 -1.412425
H  4.615623 0.957924 -0.589511
H  0.499449 -1.416018 0.129902
H  0.901695 2.853104 0.84475
H  2.513012 -0.97954 -1.8366
H  4.005711 -0.468232 -2.677413
H  -1.570121 3.149859 0.327843
H  4.003917 -1.82261 -0.134142
H  -3.500022 0.129225 -2.062324
H  -4.778078 1.358838 -1.702269
H  -4.629816 -0.13238 -0.676695
