program: Gaussian 09
title: 000104179
version: EM64L-G09RevD.01
frameworkgroup: C1[X(C16H17N)]
method: RPBEPBE
basis: SDD
operation: Freq
keyword: #pfreq=noraman
keyword: PBEPBE/SDD
title: #p freq=noraman PBEPBE/SDD
converged: NO YES NO NO
title: Mulliken charges:
elementType: N C C C C C C C C C C C C C C C C H H H H H H H H H H H H H H H H H
charge: -0.569697 -0.322931 -0.464900 -0.455529 -0.276372 0.183128 0.268200 0.511398 -0.369145 -0.366673 -0.380495 -0.464948 -0.254676 -0.259942 -0.240284 -0.227674 -0.250457 0.229074 0.202944 0.227598 0.198543 0.213069 0.231424 0.250856 0.256296 0.269870 0.258202 0.244391 0.232650 0.225890 0.225581 0.223776 0.223798 0.227034
chargesum: 0.00000
title: Mulliken charges with hydrogens summed into heavy atoms:
elementType: N C C C C C C C C C C C C C C C C
charge: -0.041625 -0.093857 -0.034358 -0.043916 -0.044949 0.183128 0.268200 0.511398 -0.118289 -0.110377 -0.136105 -0.232298 -0.028786 -0.034361 -0.016508 -0.003876 -0.023423
polarizability: 2.17436432e+02 3.93702194e+00 1.59795447e+02 -8.94797649e+00 7.75108058e+00 1.32285527e+02
1716.lowfreq: -7.4705 -0.0006 -0.0002 0.0004 6.2256 8.6155 31.5830 42.3104 67.0854
frequency: 31.5351 42.2266 67.0688 102.1301 134.9983 200.5816 217.5689 247.3796 253.6259 276.1572 318.3416 375.8325 389.6270 402.7029 408.6075 470.4519 493.9793 521.6759 536.2806 589.6058 597.2793 615.2991 624.0765 655.6646 706.8642 725.8212 749.3487 768.8217 777.4710 790.5104 831.6682 854.6419 881.4806 891.7891 902.1060 927.9169 957.4898 974.1664 976.0927 989.8103 990.4513 993.4712 1018.6775 1027.4669 1040.6936 1063.4308 1078.8746 1086.7256 1112.9166 1139.1006 1160.6479 1171.1069 1174.1977 1184.0341 1187.6535 1195.9242 1206.3090 1216.7754 1261.2561 1270.2793 1301.3603 1315.0019 1327.2639 1341.5628 1356.1136 1359.9424 1377.9831 1382.9522 1435.7251 1441.3906 1461.3619 1468.7026 1480.2378 1483.6285 1582.1289 1592.3291 1610.7476 1613.0166 1629.1200 2942.0009 2961.7605 2976.2084 2979.4957 3030.9933 3044.1446 3110.9444 3117.2993 3119.1216 3128.8039 3131.2314 3141.1564 3142.0316 3158.8252 3160.7862 3439.4193 3575.6635
redmass: 3.8545 4.0110 4.3596 3.5696 3.2859 2.5591 3.5056 1.7348 2.3277 3.4325 3.2516 2.5697 3.4417 2.8182 3.2697 3.5318 2.2350 3.1745 2.9313 2.0615 4.2021 5.0106 3.9621 3.9887 1.6809 2.4043 3.7342 1.9463 1.6963 2.7846 2.5727 1.2500 1.4013 2.7225 2.0623 1.6570 1.4346 1.9544 1.4558 1.4036 3.7404 1.4302 2.5150 2.1398 2.2667 2.2082 1.6030 1.7830 2.0739 1.4895 1.3729 1.0562 1.0714 1.8536 1.1153 2.0158 1.8407 1.7191 1.6451 1.5387 1.4516 1.3041 1.3523 1.4314 1.3151 1.6030 7.4843 7.1077 2.2628 2.1778 1.0985 1.1197 2.3813 2.3016 7.0179 6.0952 4.9923 5.6179 1.1692 1.0814 1.0696 1.0628 1.0776 1.0995 1.0994 1.0874 1.0861 1.0847 1.0887 1.0908 1.0946 1.0958 1.1008 1.1014 1.0441 1.0982
irintensity: 0.1267 0.1788 0.1544 1.4197 3.2064 11.0136 1.4190 22.3047 15.9272 2.6597 11.3845 3.9956 4.7915 0.2134 1.2115 5.6648 72.5232 23.8411 19.7376 127.9076 21.7841 2.7082 6.6896 8.8669 54.5411 23.4784 4.7535 55.9223 35.0830 7.7102 1.6430 0.0577 0.3575 11.1342 4.6935 1.2615 1.6568 3.8339 0.5736 0.1600 0.1076 0.2127 3.5781 8.4040 6.4396 7.8786 11.5279 1.7331 7.6635 6.0433 2.0527 0.1536 0.1093 3.6966 0.5307 2.1733 8.9237 0.7021 1.9666 0.9601 3.4195 3.8059 0.9880 2.0004 8.2702 6.9229 0.6172 0.5824 10.0336 7.6428 6.8846 6.1268 15.4639 27.6409 2.3237 0.6634 12.9639 6.1119 31.1130 13.0245 13.3942 44.1212 69.0177 56.3521 38.7752 9.3619 5.2429 0.7626 6.4582 11.5437 29.2945 43.0608 33.7256 26.6450 3.7024 0.0502
temp: 298.150 k
press: 1.00000 atm
elementType: 7 6 6 6 6 6 6 6 6 6 6 6 6 6 6 6 6 1 1 1 1 1 1 1 1 1 1 1 1 1 1 1 1 1
symmnumber: 1
zpe: 751130.1 jmol-1
zpe.correction: 0.286090 hartree
zpe.thermalcorrener: 0.300332 hartree
zpe.thermalcorrenthalpy: 0.301276 hartree
zpe.thermalcorrgfe: 0.244405 hartree
zpe.sumelectzpe: -673.443961 hartree
zpe.sumelectthermal: -673.429720 hartree
zpe.sumelectthermalent: -673.428775 hartree
zpe.sumelectthermalfe: -673.485646 hartree
dipole: 0.6118 -1.3769 -0.1772
dipole: 1.5171
quadrupole: -97.5474 -95.2304 -97.8333
quadrupole: 3.9668 0.1827 0.8167
quadrupole: -0.6770 1.6400 -0.9629 3.9668 0.1827 0.8167
hfenergy: -673.7300515 hartree
pointgroup: C01 [X(C16H17N1)]
dipole: 0.2756389 -0.525603 -0.0635866 debye
polarizability: 216.1214075|7.7405986|160.9286035|-11.6638448|6.242022|132.4673957 unknown
InChI: InChI=1S/C16H17N/c17-16-11-10-13(12-6-2-1-3-7-12)14-8-4-5-9-15(14)16/h1-9,13,16H,10-11,17H2
charge 0 multiplicity 1
34 atoms
N  -2.737751 -1.898747 1.519205
C  0.294046 -0.66336 -0.772869
C  -0.013761 -2.081242 -0.214497
C  -1.439116 -2.510357 -0.603137
C  -2.498664 -1.602716 0.083375
C  -0.842975 0.323521 -0.450672
C  -2.139672 -0.119022 -0.062265
C  1.677197 -0.199117 -0.309035
C  -0.613444 1.719519 -0.590106
C  -3.151746 0.837883 0.207092
C  1.898529 0.222361 1.028842
C  2.784361 -0.243221 -1.192504
C  -1.630158 2.661372 -0.338741
C  -2.911413 2.218716 0.070813
C  3.188972 0.586692 1.469062
C  4.079931 0.120367 -0.756885
C  4.287385 0.535787 0.57775
H  0.334921 -0.759827 -1.880081
H  0.089465 -2.073192 0.890015
H  0.739277 -2.794917 -0.596757
H  -1.552298 -2.445291 -1.705462
H  -1.625949 -3.563885 -0.31799
H  -3.469422 -1.768096 -0.427006
H  0.382758 2.064971 -0.889793
H  -4.131508 0.474718 0.538155
H  -1.974627 -1.608567 2.139153
H  -3.045896 -2.860125 1.701652
H  1.049996 0.28244 1.721196
H  2.629868 -0.563163 -2.231079
H  -1.426378 3.731907 -0.455545
H  -3.708285 2.941867 0.277764
H  3.340003 0.913207 2.504525
H  4.922327 0.082254 -1.45709
H  5.289127 0.820761 0.918616
