program: Gaussian 09
title: 000104177
version: EM64L-G09RevD.01
frameworkgroup: C1[X(C16H17N)]
method: RPBEPBE
basis: SDD
operation: Freq
keyword: #pfreq=noraman
keyword: PBEPBE/SDD
title: #p freq=noraman PBEPBE/SDD
converged: YES YES NO NO
title: Mulliken charges:
elementType: N C C C C C C C C C C C C C C C C H H H H H H H H H H H H H H H H H
charge: -0.621755 -0.349865 -0.436982 -0.463075 -0.266132 0.258398 0.312429 0.457784 -0.389983 -0.407716 -0.434525 -0.380699 -0.250793 -0.256997 -0.232838 -0.243329 -0.247540 0.220086 0.237380 0.212908 0.223726 0.202471 0.213184 0.244978 0.240231 0.263146 0.286608 0.232863 0.252334 0.226889 0.225552 0.222524 0.222654 0.226082
chargesum: 0.00000
title: Mulliken charges with hydrogens summed into heavy atoms:
elementType: N C C C C C C C C C C C C C C C C
charge: -0.072001 -0.129779 0.013306 -0.036877 -0.052948 0.258398 0.312429 0.457784 -0.145005 -0.167485 -0.201662 -0.128365 -0.023904 -0.031444 -0.010315 -0.020675 -0.021458
polarizability: 2.09854553e+02 5.88493550e+00 1.60387834e+02 1.19717344e+01 5.98294167e+00 1.35787035e+02
1716.lowfreq: -7.5606 -2.8424 -0.0006 -0.0004 -0.0003 9.2704 44.1252 51.2053 64.9867
frequency: 43.9337 50.9997 64.9285 106.0476 125.8216 201.1689 211.4238 232.9243 254.5980 298.1395 339.6525 366.7776 375.4959 404.9044 431.3051 472.2622 508.4678 537.7173 549.3534 571.2942 584.2658 616.3188 642.3535 685.1458 708.0498 711.1567 757.0596 768.2038 792.2424 806.5957 825.0914 854.9448 871.4252 884.9881 902.7360 927.2328 954.8771 977.3938 980.3493 988.3123 990.0468 993.0395 997.0425 1027.3800 1036.5243 1072.2268 1079.2541 1084.2288 1113.7744 1142.4972 1159.8088 1169.7602 1170.8994 1174.9552 1189.0886 1190.3715 1211.8986 1223.0896 1251.1180 1270.6729 1308.1570 1311.1795 1334.2323 1346.1085 1356.4726 1372.8495 1380.1354 1386.9737 1435.9307 1441.4781 1462.2265 1466.8586 1481.4185 1486.4291 1587.3349 1592.1501 1609.2910 1612.0442 1625.8408 2866.6948 2972.3509 2987.4841 3003.3185 3040.9908 3060.8672 3105.3404 3109.1365 3116.1670 3120.5423 3133.2324 3135.1036 3143.6577 3157.3487 3160.2745 3442.7106 3578.1064
redmass: 3.7808 3.9075 4.6248 3.6092 3.8367 2.6401 2.6111 1.6295 4.0131 2.7183 2.8658 2.8046 3.2509 2.8454 3.8784 3.6105 3.2369 2.9759 2.2252 1.8622 4.1923 6.1254 4.5210 3.0123 1.6920 4.3079 1.8889 1.5049 3.4691 2.8344 2.6445 1.2513 2.1949 1.6996 2.1457 1.6724 1.4060 1.4076 2.2366 1.3344 4.5229 1.3952 2.0976 2.2293 2.4736 1.8327 1.9220 1.9175 1.7623 1.2583 1.5652 1.3641 1.0670 1.1729 1.6632 1.3991 1.9417 1.3366 1.4272 1.6297 1.3986 1.4197 1.3546 1.4785 1.4667 2.4655 4.0457 4.1080 2.2213 2.2809 1.1223 1.0952 2.1477 2.5134 6.7869 6.2366 5.6896 5.3864 1.1450 1.0823 1.0815 1.0601 1.0629 1.1010 1.1036 1.0875 1.0870 1.0880 1.0857 1.0913 1.0926 1.0955 1.1004 1.1014 1.0446 1.0980
irintensity: 0.2007 0.2762 0.0589 1.8358 0.9123 2.6265 9.3297 24.8666 0.8798 9.0522 1.1441 1.4546 2.4857 0.1642 1.9207 4.0416 9.3941 12.5403 45.7200 110.9288 4.9332 0.9121 3.6627 25.6122 51.2748 1.9978 48.1995 55.9407 0.8978 8.9864 5.9205 0.0726 1.8570 1.6888 1.4041 0.4572 1.3040 1.1688 30.4056 0.3493 1.3597 0.2217 0.2288 6.5907 7.9885 6.0055 6.3814 9.5550 4.1948 1.1946 2.4532 4.2637 0.2165 0.7457 1.3606 3.2137 2.4605 0.9076 3.7599 0.1268 16.7662 11.0794 0.3848 1.6264 5.4335 2.6107 1.9614 3.0070 9.0954 2.5487 11.2402 7.9002 20.6571 22.7272 2.7145 1.6680 5.7813 10.1004 53.8517 77.7723 14.9994 45.8052 33.5756 43.6883 32.1792 13.6402 9.2658 3.8870 0.3570 17.4161 26.6284 40.4986 35.0282 26.8983 2.2096 0.1967
temp: 298.150 k
press: 1.00000 atm
elementType: 7 6 6 6 6 6 6 6 6 6 6 6 6 6 6 6 6 1 1 1 1 1 1 1 1 1 1 1 1 1 1 1 1 1
symmnumber: 1
zpe: 751638.1 jmol-1
zpe.correction: 0.286284 hartree
zpe.thermalcorrener: 0.300434 hartree
zpe.thermalcorrenthalpy: 0.301378 hartree
zpe.thermalcorrgfe: 0.245072 hartree
zpe.sumelectzpe: -673.443366 hartree
zpe.sumelectthermal: -673.429216 hartree
zpe.sumelectthermalent: -673.428272 hartree
zpe.sumelectthermalfe: -673.484578 hartree
dipole: 0.9168 -0.4039 0.7648
dipole: 1.2603
quadrupole: -89.9854 -96.9550 -98.2403
quadrupole: -1.1797 5.5262 -1.0058
quadrupole: 5.0748 -1.8947 -3.1801 -1.1797 5.5262 -1.0058
hfenergy: -673.7296499 hartree
pointgroup: C01 [X(C16H17N1)]
dipole: -0.3572989 -0.1741701 -0.296436 debye
polarizability: 209.701547|-5.0137353|159.7464672|12.8717225|-7.0363126|136.5814073 unknown
InChI: InChI=1S/C16H17N/c17-16-11-10-13(12-6-2-1-3-7-12)14-8-4-5-9-15(14)16/h1-9,13,16H,10-11,17H2
charge 0 multiplicity 1
34 atoms
N  -3.023872 -2.258314 0.119633
C  0.237244 -0.467533 1.028802
C  -0.079117 -1.985146 0.859205
C  -0.640105 -2.282694 -0.543363
C  -2.003986 -1.578656 -0.72612
C  -0.91575 0.405929 0.524284
C  -1.940494 -0.104248 -0.318864
C  1.585474 -0.115416 0.374056
C  -0.950152 1.777494 0.887563
C  -2.960931 0.767683 -0.780353
C  2.786792 -0.397535 1.07688
C  1.683571 0.434766 -0.929035
C  -1.974089 2.63494 0.436822
C  -2.988665 2.127655 -0.409564
C  4.048796 -0.144819 0.496616
C  2.945346 0.687389 -1.515646
C  4.133482 0.398323 -0.807216
H  0.35225 -0.2780 2.11577
H  -0.844663 -2.284327 1.599595
H  0.836024 -2.574926 1.049895
H  0.066157 -1.939073 -1.324073
H  -0.772281 -3.373599 -0.679482
H  -2.275703 -1.615626 -1.809693
H  -0.152588 2.173192 1.528695
H  -3.735869 0.371496 -1.450204
H  -3.260028 -3.204718 -0.198449
H  -3.854391 -1.69001 0.313405
H  2.729365 -0.817196 2.089851
H  0.769428 0.683227 -1.47973
H  -1.979516 3.689279 0.73542
H  -3.783529 2.785877 -0.777924
H  4.963137 -0.365511 1.059639
H  2.999648 1.113893 -2.524088
H  5.111016 0.598301 -1.260428
