program: Gaussian 09
title: 000104188
version: EM64L-G09RevD.01
frameworkgroup: C1[X(C18H12N4O2)]
method: RPBEPBE
basis: SDD
operation: Freq
keyword: #p
keyword: freq=noraman
keyword: PBEPBE/SDD
title: #p freq=noraman PBEPBE/SDD
converged: YES YES NO NO
title: Mulliken charges:
elementType: O O N N N N C C C C C C C C C C C C C C C C C C H H H H H H H H H H H H
charge: -0.304126 -0.289033 -0.401152 -0.645102 0.005896 0.011970 0.129957 0.162564 0.097578 0.281941 0.294104 -0.158465 -0.172964 -0.039323 0.241851 0.243942 -0.383640 -0.379872 -0.312604 -0.226674 -0.227036 -0.721917 -0.289263 -0.301773 0.393918 0.294935 0.294390 0.243247 0.243583 0.240784 0.241225 0.344113 0.396854 0.228775 0.228784 0.232532
chargesum: 0.00000
title: Mulliken charges with hydrogens summed into heavy atoms:
elementType: O O N N N N C C C C C C C C C C C C C C C C C C
charge: -0.304126 -0.289033 -0.007233 0.095865 0.005896 0.011970 0.129957 0.162564 0.097578 0.281941 0.294104 -0.158465 -0.172964 -0.039323 0.241851 0.243942 -0.088705 -0.085481 0.174225 0.014110 0.014189 -0.031825 -0.289263 -0.301773
polarizability: 4.65310357e+02 -2.51917929e+01 2.93681820e+02 -8.12852888e-02 -1.44622740e-01 9.32377056e+01
1716.lowfreq: -0.0004 -0.0001 0.0006 2.4249 5.3974 7.3360 17.2408 41.6265 58.0847
frequency: 16.6819 41.6019 58.0784 99.8296 104.7824 108.0535 123.2641 123.6341 152.3466 160.7103 167.1265 211.0514 223.5898 250.3087 285.0242 285.5523 297.4152 336.0895 346.1158 347.6041 372.6220 408.7629 415.5080 424.4736 434.9692 462.2600 481.5413 498.2615 502.0927 520.1067 544.5790 566.5454 590.4676 606.2018 617.9255 674.7277 701.3025 701.9906 717.0965 741.4554 753.7175 807.6603 812.3216 831.6062 849.4014 863.5271 888.5364 902.0402 903.0624 935.2919 954.4819 984.1266 998.4949 1015.4663 1030.8769 1039.9570 1073.4239 1096.4583 1129.7627 1132.7445 1150.1176 1166.7322 1173.6622 1213.0920 1264.6660 1273.2468 1286.8266 1327.0610 1347.7504 1360.3075 1370.4107 1388.4746 1399.1453 1404.4443 1413.1562 1446.1111 1450.7393 1472.7018 1476.0151 1476.7972 1486.0801 1517.3523 1524.4093 1562.6055 1591.8503 1606.5661 1608.8969 1619.7592 2158.4420 2165.3540 2984.2181 2991.9080 3009.3565 3036.9162 3090.9115 3100.4454 3138.3700 3155.2075 3168.9909 3176.2394 3236.4380 3586.9445
redmass: 5.0044 6.5638 8.8971 3.1284 3.3879 4.3014 8.7482 3.3294 6.5248 8.0531 3.8534 6.1815 5.2367 1.5233 4.9350 4.5181 8.0429 5.1790 5.1489 9.5608 10.0315 6.1940 7.3710 3.4197 7.9106 10.1873 4.9943 7.2413 8.1390 9.8853 8.3832 1.2013 6.3652 7.1398 7.6351 6.9195 5.3332 7.3419 6.9725 2.7245 6.0803 1.8594 1.1046 4.3827 1.1085 6.3360 3.8120 1.1211 2.6502 2.0393 4.6894 4.5392 1.3872 1.3628 2.1690 5.8716 3.9091 2.0241 1.4889 2.8093 2.1020 2.3339 1.2725 2.3923 2.1202 1.1155 3.8456 2.7169 3.8623 2.1640 3.1846 9.0229 1.3437 4.2343 7.3203 5.5152 2.9090 2.2517 1.0392 1.1525 1.0891 6.9477 7.8781 2.7255 2.1198 6.7510 7.3460 1.6836 12.6257 12.6185 1.0624 1.0371 1.0801 1.1039 1.1015 1.0992 1.0866 1.0909 1.0945 1.0994 1.0633 1.0895
irintensity: 1.9243 0.7246 0.0723 9.3407 0.4688 0.0178 2.8712 0.8023 0.0053 3.2145 0.5355 0.2249 2.3322 0.9798 1.8665 0.1301 4.5288 2.4928 0.2730 0.3457 0.2746 4.5146 0.1131 0.6736 26.6858 7.9576 3.1396 0.5257 0.1411 3.9827 6.5197 128.0191 6.2980 0.3204 4.6398 5.7969 1.2315 1.6111 4.5817 23.2657 1.9939 48.1121 5.6635 2.5230 135.2264 3.7635 0.0636 88.1914 18.1196 0.1823 87.8850 7.4466 5.0022 0.0000 8.8129 1.5981 27.9666 4.7344 3.2972 15.5105 5.6187 8.3945 13.6798 0.2066 22.5519 0.1674 328.7610 438.7369 16.7330 185.7918 101.2793 6.9787 49.6029 25.8059 13.8419 38.0466 2.4780 8.6756 14.3105 68.8164 19.2332 215.5326 313.9778 24.0595 150.0403 29.4228 8.0479 102.6915 65.1616 6.2131 27.6168 17.4772 15.7227 8.7364 36.2819 24.9981 4.1347 13.8995 1.2723 29.5309 45.7046 81.1626
temp: 298.150 k
press: 1.00000 atm
elementType: 8 8 7 7 7 7 6 6 6 6 6 6 6 6 6 6 6 6 6 6 6 6 6 6 1 1 1 1 1 1 1 1 1 1 1 1
symmnumber: 1
zpe: 688471.4 jmol-1
zpe.correction: 0.262225 hartree
zpe.thermalcorrener: 0.282281 hartree
zpe.thermalcorrenthalpy: 0.283225 hartree
zpe.thermalcorrgfe: 0.213229 hartree
zpe.sumelectzpe: -1060.957737 hartree
zpe.sumelectthermal: -1060.937681 hartree
zpe.sumelectthermalent: -1060.936737 hartree
zpe.sumelectthermalfe: -1061.006733 hartree
dipole: -4.7569 2.6794 0.0171
dipole: 5.4596
quadrupole: -149.7750 -134.0465 -139.8918
quadrupole: 11.1377 0.1245 0.0035
quadrupole: -8.5372 7.1913 1.3460 11.1377 0.1245 0.0035
hfenergy: -1061.2199616 hartree
pointgroup: C01 [X(C18H12N4O2)]
dipole: -1.9029274 0.9962603 0.0117232 debye
polarizability: 466.647826|-19.9797513|292.1744095|3.6485835|4.9620961|93.4076474 unknown
InChI: InChI=1S/C18H12N4O2/c1-2-22-16-12(8-20)11(7-19)15(21)13-14(16)18(24)10-6-4-3-5-9(10)17(13)23/h3-6,22H,2,21H2,1H3
charge 0 multiplicity 1
36 atoms
O  -0.984163 2.588724 0.098681
O  -1.949408 -2.847572 -0.050998
N  1.534291 2.212046 0.119039
N  0.565336 -3.361693 -0.035427
N  4.973384 0.473642 0.099599
N  4.040133 -3.306046 -0.001304
C  -0.038895 0.35073 0.051655
C  -0.306031 -1.064059 0.012419
C  1.32954 0.860318 0.080001
C  -2.553406 0.785523 0.033131
C  -2.811275 -0.612628 -0.005834
C  -1.166307 1.302161 0.063208
C  -1.692156 -1.579263 -0.016653
C  0.779717 -2.010925 0.000511
C  2.40804 -0.11069 0.064766
C  2.128715 -1.500159 0.026735
C  -3.638837 1.699815 0.042975
C  -4.148856 -1.084911 -0.034479
C  2.797426 2.973801 0.157927
C  -4.962745 1.224705 0.014402
C  -5.219286 -0.172229 -0.024429
C  2.480012 4.478374 0.201923
C  3.796244 0.256806 0.085266
C  3.198156 -2.455344 0.012523
H  0.629807 2.747258 0.121883
H  -3.412829 2.769513 0.07306
H  -4.314005 -2.165869 -0.0642
H  3.393093 2.690518 1.046241
H  3.414051 2.746765 -0.73216
H  -5.798201 1.932742 0.022053
H  -6.251406 -0.53757 -0.046549
H  1.349277 -4.014481 -0.043945
H  -0.426989 -3.662108 -0.053181
H  1.911987 4.793249 -0.691725
H  1.888293 4.735737 1.098649
H  3.41839 5.057719 0.233037
