program: Gaussian 09
title: 000104287
version: EM64L-G09RevD.01
frameworkgroup: C1[X(C18H19BrN6O5)]
method: RPBEPBE
basis: SDD
operation: Freq
keyword: #p
keyword: freq=noraman
keyword: PBEPBE/SDD
title: #p freq=noraman PBEPBE/SDD
converged: YES YES NO NO
title: Mulliken charges:
elementType: Br O O O O O N N N N N N C C C C C C C C C C C C C C C C C C H H H H H H H H H H H H H H H H H H H
charge: 0.051998 -0.266446 -0.203563 -0.179560 -0.202977 -0.209939 -0.150600 -0.429069 -0.098290 -0.099685 0.016163 0.014011 0.529838 -0.402359 -0.396836 -0.505561 -0.364394 0.344979 -0.036248 -0.651713 -0.656149 -0.274700 0.254294 0.211133 0.309742 -0.295537 -0.531514 0.451866 -0.368847 -0.790049 0.248646 0.227573 0.233753 0.234148 0.320726 0.239678 0.228053 0.213628 0.252435 0.226142 0.222687 0.240317 0.275258 0.365558 0.335790 0.309733 0.244019 0.264844 0.247021
chargesum: 0.00000
title: Mulliken charges with hydrogens summed into heavy atoms:
elementType: Br O O O O O N N N N N N C C C C C C C C C C C C C C C C C C
charge: 0.051998 -0.266446 -0.203563 -0.179560 -0.202977 -0.209939 -0.150600 -0.063510 -0.098290 -0.099685 0.016163 0.014011 0.529838 0.073860 0.071066 -0.184835 -0.124716 0.344979 -0.036248 0.042403 0.032997 0.000559 0.254294 0.211133 0.309742 -0.295537 -0.195724 0.451866 -0.059113 -0.034165
polarizability: 7.84862729e+02 1.30576359e+00 3.02657107e+02 -1.61402640e+01 1.32000060e+01 1.85997081e+02
1716.lowfreq: -60.1400 -2.7808 -0.0009 -0.0007 0.0003 2.8941 8.0482 13.8097 16.7562
frequency: -60.1349 13.5489 16.6969 22.1516 36.3214 44.6056 52.7159 59.2587 64.5870 70.9636 73.9699 80.5636 103.7930 110.5943 120.4060 125.1731 135.9712 139.9645 166.2995 189.1526 194.6812 204.6576 209.6511 235.7246 255.5455 264.7029 268.2265 301.6176 306.8877 316.3830 337.7874 344.4943 352.8748 378.7795 404.1092 414.8738 437.1653 467.1528 489.8684 503.6449 514.8328 523.4391 539.1283 543.2365 572.3378 578.1703 631.1890 645.8465 649.7725 656.7798 671.2485 679.4595 698.7941 702.5993 744.9143 751.7542 773.2167 784.3008 792.5320 810.1176 814.8211 828.0432 833.1795 852.2303 889.9434 902.7928 925.0769 932.0449 932.8573 950.1987 956.1948 974.7146 999.8943 1016.3623 1035.3347 1051.2409 1073.3875 1074.9731 1094.9299 1109.1999 1120.7796 1157.0575 1167.8973 1176.8383 1189.5649 1195.3049 1207.8939 1216.1843 1234.6954 1262.6976 1284.0861 1300.9579 1305.8391 1335.1144 1339.1416 1345.7122 1352.1866 1365.2545 1376.8030 1379.2921 1385.0570 1389.8321 1393.4218 1400.2692 1421.6951 1438.4482 1447.0380 1465.0118 1465.6634 1467.7391 1472.8777 1477.0620 1481.5072 1494.1252 1507.0700 1511.7455 1530.2334 1548.6826 1551.0671 1584.5562 1620.3241 1632.4639 2989.0390 2990.7136 2991.0226 3007.8786 3012.3328 3057.8646 3062.7922 3075.2214 3088.2341 3088.8754 3096.4747 3102.1080 3138.5515 3158.3903 3182.4443 3184.0289 3193.7432 3207.7026 3401.7195
redmass: 1.0294 7.9822 8.9343 8.2973 4.1457 5.0010 11.7834 15.0469 5.1380 3.5536 3.2859 6.0188 5.1485 8.1095 4.1764 4.9280 4.8598 11.3449 7.4779 3.8068 1.5914 5.3023 1.1063 2.5058 4.7880 14.2924 4.6654 5.3975 4.4284 3.8750 9.8672 6.7887 6.7429 5.2294 4.8363 5.7982 4.0901 5.1865 3.6963 3.2016 6.0773 5.6727 4.3759 3.3325 4.4223 3.1664 5.9160 6.3807 3.9089 7.3459 9.7117 10.5130 5.4584 6.8568 5.2245 4.6962 9.9457 1.2187 1.2187 4.5867 1.8389 1.1607 6.7318 2.5766 9.9362 1.4756 2.2885 4.8201 1.4187 2.1556 1.4398 1.3236 1.8703 2.6237 1.6788 2.3112 2.2451 1.8745 1.7549 2.2426 4.6419 1.7737 1.9473 3.5572 3.5824 2.3860 4.0138 3.3453 1.8682 1.5690 1.2078 1.4898 3.1161 3.8901 1.2609 1.3591 9.4969 11.4535 2.9196 1.3916 1.9999 1.2614 1.3255 4.8118 6.5676 5.6801 1.2837 1.0754 1.0762 1.0520 1.8196 1.0820 1.1093 1.2911 2.5300 1.5328 2.2378 7.7975 4.0560 7.8679 5.0064 6.9482 1.0355 1.0384 1.0358 1.0612 1.0613 1.1022 1.1020 1.0979 1.0998 1.1001 1.1017 1.1013 1.0985 1.0879 1.0952 1.0926 1.0926 1.0914 1.0767
irintensity: 0.5666 0.3265 0.2076 0.1274 0.1699 0.0611 0.5352 0.0473 3.5865 1.5655 1.0486 6.7300 5.1085 1.5108 1.7731 1.9537 5.5185 7.4715 2.0124 0.2903 1.1286 2.9760 2.7448 2.9839 4.5027 1.8826 3.4134 0.1234 2.1348 1.1665 4.7374 2.5184 10.9230 0.7486 2.3670 40.0814 7.6379 9.5063 11.8605 7.1212 26.9343 1.9075 38.4597 14.7646 0.2829 0.9610 0.4182 21.0085 11.4996 4.8022 29.0513 32.1256 29.8619 56.4888 11.0954 26.6439 15.4631 6.3068 11.3261 15.8895 42.0562 52.9850 140.3543 7.5690 49.9722 36.9045 10.4674 15.7917 18.2764 11.5912 22.7045 0.6771 39.1725 23.9156 7.5571 109.7682 16.3142 74.1464 19.5414 140.4942 65.5306 6.2879 12.8682 146.6777 549.5784 187.7321 982.1371 207.4885 62.3667 208.6812 23.6343 58.7236 81.7578 67.4375 9.1230 238.8922 110.2540 125.7309 42.7613 61.5959 265.3009 42.3149 21.0689 212.2683 902.0880 241.0919 125.3270 34.2814 18.9781 33.2066 241.3624 25.3140 27.3772 32.8967 98.2205 3.6492 44.8777 99.9412 300.1720 289.0757 29.7083 703.5430 30.2970 3.2426 33.2508 35.1041 81.5575 1.9220 2.4871 10.7275 34.4991 42.5775 36.2576 52.8584 9.3139 0.8831 15.3213 8.3010 26.7865 9.6257 83.1843
temp: 298.150 k
press: 1.00000 atm
elementType: 35 8 8 8 8 8 7 7 7 7 7 7 6 6 6 6 6 6 6 6 6 6 6 6 6 6 6 6 6 6 1 1 1 1 1 1 1 1 1 1 1 1 1 1 1 1 1 1 1
symmnumber: 1
zpe: 944182.5 jmol-1
zpe.correction: 0.359620 hartree
zpe.thermalcorrener: 0.388828 hartree
zpe.thermalcorrenthalpy: 0.389772 hartree
zpe.thermalcorrgfe: 0.295166 hartree
zpe.sumelectzpe: -1413.028511 hartree
zpe.sumelectthermal: -1412.999304 hartree
zpe.sumelectthermalent: -1412.998360 hartree
zpe.sumelectthermalfe: -1413.092966 hartree
dipole: -12.1959 0.9052 2.3504
dipole: 12.4532
quadrupole: -194.5517 -186.8580 -186.5851
quadrupole: 29.0982 -10.1901 -14.9491
quadrupole: -5.2201 2.4736 2.7465 29.0982 -10.1901 -14.9491
hfenergy: -1413.3881316 hartree
pointgroup: C01 [X(C18H19Br1N6O5)]
dipole: 4.844101 -0.2150327 -0.7023596 debye
polarizability: 784.780286|-0.0280713|245.9351755|16.6728731|-60.0246719|242.8014559 unknown
InChI: InChI=1S/C18H19BrN6O5/c1-4-23(5-2)12-6-7-15(16(9-12)20-11(3)26)21-22-18-14(19)8-13(24(27)28)10-17(18)25(29)30/h6-10,20H,4-5H2,1-3H3
charge 0 multiplicity 1
49 atoms
Br -1.77272 0.697042 -2.701332
O  3.612077 3.390483 -0.985307
O  -3.809837 -1.808124 3.05496
O  -1.841338 -0.684219 2.775017
O  -7.496003 -0.694813 0.090372
O  -7.055845 0.101198 -2.008483
N  5.299191 -1.007304 0.26477
N  1.642523 2.177175 -0.591686
N  -0.164709 0.324131 -0.017206
N  -1.099806 -0.541932 0.288312
N  -2.994978 -1.086544 2.35374
N  -6.684215 -0.29716 -0.833943
C  3.949645 -0.704517 0.207901
C  6.338551 -0.031036 -0.150299
C  5.796399 -2.318825 0.747231
C  3.514981 0.607956 -0.170684
C  2.951435 -1.703557 0.529699
C  2.147761 0.914246 -0.233146
C  1.155521 -0.093626 0.082479
C  6.760973 0.928041 0.984845
C  5.878915 -3.385866 -0.367602
C  1.599118 -1.396182 0.465121
C  -2.436974 -0.293676 0.019989
C  2.34686 3.332078 -0.943684
C  -3.422793 -0.69699 0.993641
C  -2.964538 0.135126 -1.251225
C  -4.799606 -0.721642 0.731099
C  -5.241806 -0.299218 -0.533817
C  -4.333669 0.134282 -1.530472
C  1.450512 4.520342 -1.277145
H  5.977832 0.540241 -1.023123
H  7.214125 -0.611558 -0.494687
H  6.801138 -2.15058 1.176039
H  5.162179 -2.672375 1.578918
H  4.217898 1.406872 -0.401737
H  3.251309 -2.713208 0.819023
H  7.551359 1.612091 0.627069
H  7.156316 0.368359 1.851651
H  5.909485 1.539285 1.327874
H  6.285893 -4.330242 0.037116
H  6.540364 -3.050812 -1.186401
H  4.884157 -3.59304 -0.79851
H  0.839322 -2.143209 0.71443
H  0.611698 2.203834 -0.579624
H  -5.506494 -1.048678 1.497083
H  -4.724317 0.459051 -2.498027
H  0.803241 4.785109 -0.42092
H  2.083758 5.383259 -1.527179
H  0.795414 4.294134 -2.138841
