program: Gaussian 09
title: 000104171
version: EM64L-G09RevD.01
frameworkgroup: C1[X(C18H19NO)]
method: RPBEPBE
basis: SDD
operation: Freq
keyword: #p
keyword: freq=noraman
keyword: PBEPBE/SDD
title: #p freq=noraman PBEPBE/SDD
converged: YES YES NO NO
title: Mulliken charges:
elementType: O N C C C C C C C C C C C C C C C C C C H H H H H H H H H H H H H H H H H H H
charge: -0.258065 -0.025525 -0.340231 -0.397799 -0.351323 -0.309013 -0.692147 0.350593 0.354937 0.356517 -0.363241 -0.393821 -0.390102 -0.365547 -0.377639 -0.380813 -0.384880 -0.382771 0.392838 -0.262544 0.186723 0.186640 0.213538 0.213728 0.198222 0.198239 0.207600 0.207616 0.210074 0.210024 0.219846 0.250199 0.253172 0.234168 0.237659 0.242026 0.242633 0.254096 0.254377
chargesum: 0.00000
title: Mulliken charges with hydrogens summed into heavy atoms:
elementType: O N C C C C C C C C C C C C C C C C C C
charge: -0.258065 -0.025525 0.033132 0.029467 0.045137 0.106202 -0.052203 0.350593 0.354937 0.356517 -0.113042 -0.140649 -0.155934 -0.127888 -0.135612 -0.138181 -0.130784 -0.128395 0.392838 -0.262544
polarizability: 4.18567081e+02 1.45532554e+01 1.76904242e+02 -3.44440340e+00 3.44230409e+00 1.07485597e+02
1716.lowfreq: -2.0573 -0.0003 0.0006 0.0012 1.6974 14.9223 20.0006 34.7692 48.1785
frequency: 19.7758 34.7411 48.0729 56.9812 68.6784 76.3293 92.9939 124.7473 137.6678 145.8062 157.5502 169.5013 194.4343 225.0861 230.8727 294.8167 307.5854 339.6191 404.0812 409.3778 415.1147 436.0208 462.4060 484.9410 527.4206 531.9456 550.2181 571.2776 629.5374 644.9766 650.4542 724.4989 732.9035 748.0438 769.0117 775.2927 805.7726 816.2966 833.4083 846.8946 858.3298 861.7695 892.3094 943.7444 963.7809 968.6395 970.8827 972.5265 978.6152 989.6273 1008.3094 1019.7728 1024.4468 1071.4061 1076.3277 1123.7412 1124.1509 1127.8036 1146.6752 1182.8987 1191.9252 1203.1079 1213.3173 1238.1121 1255.4791 1264.0595 1286.9523 1295.6734 1295.8551 1305.5840 1308.5022 1321.8181 1336.1502 1358.2377 1368.0429 1383.5632 1392.8255 1420.8514 1428.2229 1468.3842 1468.7355 1475.6931 1478.3248 1481.8936 1487.2279 1492.3753 1521.4081 1547.8156 1575.2790 1612.5007 1624.9734 2172.6046 2949.0613 2957.7106 2972.9784 2974.4937 2996.2159 2998.4527 3007.6162 3027.9227 3063.2319 3071.8478 3074.9994 3133.5088 3137.8379 3140.4144 3142.9119 3162.2058 3165.8494 3166.8227 3169.8866
redmass: 4.8207 5.2173 5.4970 1.8088 3.0268 4.3488 4.4204 3.6038 2.1853 4.4539 2.7348 5.7262 4.4813 4.3567 1.2299 5.9740 4.5784 4.5101 2.8790 4.7305 2.9925 3.7266 4.9485 4.6064 5.6624 3.1091 6.1781 2.6703 6.9083 7.2292 6.4741 3.6589 1.0720 3.5493 6.1957 1.1242 5.2854 1.3714 1.4926 1.2571 1.4069 1.4037 1.9686 1.3642 1.4526 3.4417 1.4535 1.1843 1.4032 5.4549 3.0009 3.6524 2.4021 2.4032 2.5563 1.5661 1.4172 2.1006 1.4395 1.3153 1.5758 1.4535 2.0472 2.3665 1.2972 1.2350 1.0626 2.4844 1.1892 1.4039 1.3331 1.3577 2.7976 1.5774 4.9925 1.5729 1.2293 3.6483 4.1255 1.0699 1.0900 1.1390 1.0428 1.3397 1.3566 1.1782 2.8681 6.3189 7.3021 6.0324 6.3879 12.6296 1.0552 1.0586 1.0576 1.0382 1.0595 1.0989 1.1061 1.1035 1.1047 1.1013 1.0992 1.0887 1.0884 1.0877 1.0877 1.0964 1.0944 1.0976 1.0962
irintensity: 0.3163 0.4678 0.6520 0.1598 1.0882 1.1582 2.4891 0.2646 0.6176 2.3103 1.7047 1.1398 0.4754 3.4430 0.3160 0.6664 0.3451 1.2519 0.0329 0.9015 1.7567 0.6858 3.1210 1.6983 21.2611 18.6477 0.8774 10.3407 0.8007 0.3707 15.8674 2.0980 11.4172 0.7721 5.0549 1.2366 3.1889 30.5092 106.8584 0.2077 11.6134 10.6694 19.4911 0.4530 5.2195 88.6779 7.6578 4.5603 1.5249 1.2763 0.4556 6.6332 9.1264 28.3635 5.1895 16.8960 5.7135 6.9467 0.5299 212.1033 29.0556 0.5238 43.7765 247.4285 15.4697 0.0054 0.0492 46.5652 5.9076 7.8566 0.1189 0.7593 3.2261 2.4767 4.2234 30.3816 17.8727 4.9167 6.6945 0.2082 8.1826 66.6501 13.5174 79.9612 71.3603 8.7855 18.2913 1.7982 17.3401 268.9640 40.2380 100.8028 25.2162 18.8532 58.1731 32.0414 39.2902 3.3786 22.4843 13.3664 26.0733 123.5100 53.8014 12.2349 19.7608 3.5645 2.3014 12.4448 19.9745 1.1353 5.6753
temp: 298.150 k
press: 1.00000 atm
elementType: 8 7 6 6 6 6 6 6 6 6 6 6 6 6 6 6 6 6 6 6 1 1 1 1 1 1 1 1 1 1 1 1 1 1 1 1 1 1 1
symmnumber: 1
zpe: 839720.9 jmol-1
zpe.correction: 0.319833 hartree
zpe.thermalcorrener: 0.339094 hartree
zpe.thermalcorrenthalpy: 0.340038 hartree
zpe.thermalcorrgfe: 0.270064 hartree
zpe.sumelectzpe: -825.841703 hartree
zpe.sumelectthermal: -825.822442 hartree
zpe.sumelectthermalent: -825.821497 hartree
zpe.sumelectthermalfe: -825.891472 hartree
dipole: 7.4810 -0.5148 0.1290
dipole: 7.4998
quadrupole: -167.0125 -109.5395 -122.1415
quadrupole: -11.0884 1.2152 1.6830
quadrupole: -34.1147 23.3583 10.7563 -11.0884 1.2152 1.6830
hfenergy: -826.1615355 hartree
pointgroup: C01 [X(C18H19N1O1)]
dipole: -2.935521 0.2830771 0.0944188 debye
polarizability: 418.480507|7.3200981|165.5961385|-14.5312592|-25.5701844|118.8802742 unknown
InChI: InChI=1S/C18H19NO/c1-2-3-4-13-20-18-11-9-17(10-12-18)16-7-5-15(14-19)6-8-16/h5-12H,2-4,13H2,1H3
charge 0 multiplicity 1
39 atoms
O  -3.059945 -0.859543 0.355824
N  8.068593 0.48808 -0.453581
C  -6.498839 0.790026 0.176173
C  -5.415334 -0.300519 0.342827
C  -7.933545 0.232023 0.319855
C  -4.002784 0.268511 0.200876
C  -9.017752 1.317733 0.15077
C  -1.692164 -0.593419 0.241913
C  1.141823 -0.279287 0.039101
C  2.615604 -0.116986 -0.067007
C  -1.133695 0.690046 0.011398
C  -0.836206 -1.717402 0.372521
C  0.265638 0.831242 -0.088223
C  0.554205 -1.557514 0.273369
C  3.189217 0.905206 -0.877715
C  3.505175 -0.977675 0.639308
C  4.581441 1.066832 -0.978825
C  4.899471 -0.830062 0.543075
C  5.456055 0.197839 -0.268335
C  6.881994 0.35595 -0.369394
H  -6.395059 1.271668 -0.818727
H  -6.344196 1.590872 0.929428
H  -5.558511 -1.094691 -0.414764
H  -5.511662 -0.781129 1.335167
H  -8.088814 -0.568932 -0.431045
H  -8.039148 -0.248216 1.313687
H  -3.799002 1.029925 0.982565
H  -3.859322 0.734192 -0.796614
H  -8.903762 2.114701 0.909694
H  -8.952291 1.792212 -0.846553
H  -10.032986 0.893889 0.256743
H  -1.769222 1.575493 -0.078997
H  -1.285515 -2.701069 0.53855
H  0.68058 1.835033 -0.233144
H  1.193106 -2.444579 0.344717
H  2.535813 1.562076 -1.461469
H  3.098478 -1.753473 1.296415
H  5.001855 1.853363 -1.613473
H  5.565304 -1.496814 1.100089
