program: Gaussian 09
title: 000104190
version: EM64L-G09RevD.01
frameworkgroup: C1[X(C16H30O3)]
method: RPBEPBE
basis: SDD
operation: Freq
keyword: #pfreq=noraman
keyword: PBEPBE/SDD
title: #p freq=noraman PBEPBE/SDD
converged: YES YES NO NO
title: Mulliken charges:
elementType: O O O C C C C C C C C C C C C C C C C H H H H H H H H H H H H H H H H H H H H H H H H H H H H H H
charge: -0.248321 -0.250161 -0.194297 -0.386723 -0.383666 -0.383423 -0.383119 -0.383174 -0.371966 -0.378773 -0.354083 -0.393289 -0.356194 -0.290363 -0.696703 0.280742 -0.582518 0.222736 -0.755252 0.194472 0.194965 0.192818 0.193728 0.194247 0.194652 0.192000 0.192843 0.197647 0.196971 0.188959 0.189768 0.195380 0.196401 0.187609 0.188113 0.213754 0.217551 0.194851 0.194598 0.231136 0.228552 0.209670 0.215143 0.209775 0.277315 0.237779 0.233186 0.283336 0.251329
chargesum: 0.00000
title: Mulliken charges with hydrogens summed into heavy atoms:
elementType: O O O C C C C C C C C C C C C C C C C
charge: -0.248321 -0.250161 -0.194297 0.002714 0.002880 0.005476 0.001724 0.011444 0.006760 0.013008 0.021639 0.038016 0.033255 0.169325 -0.062115 0.280742 -0.067424 0.222736 0.012599
polarizability: 2.55642941e+02 7.49406925e-01 1.63793382e+02 4.79857057e+00 -2.29419783e+00 1.45879958e+02
1716.lowfreq: -17.3141 -0.0018 0.0004 0.0012 1.0564 4.7059 5.8612 15.4914 20.6352
frequency: -11.1447 14.5825 20.4188 28.4460 34.4118 44.8037 52.7664 58.8907 65.2966 84.0658 96.3594 106.3863 117.3096 125.6124 130.5962 144.3156 153.4158 154.6577 158.1288 184.3181 213.3366 230.1421 252.4833 265.7267 330.5744 344.6459 388.8793 414.9717 449.9450 473.1871 490.3150 498.5990 520.7854 590.3574 708.6612 719.4124 721.3123 726.7704 738.8657 759.0454 792.7232 795.8426 833.2285 840.9905 884.1952 887.3751 888.7789 937.6531 938.4486 980.8046 988.7395 992.1065 1012.3192 1017.5412 1029.5054 1030.2994 1038.5247 1054.6363 1070.9126 1078.3278 1081.4080 1082.5843 1097.9870 1103.7635 1125.6278 1150.3280 1181.7403 1183.5518 1202.7226 1204.0902 1223.3144 1228.3695 1233.8351 1252.3342 1260.6415 1271.1491 1278.9405 1280.6971 1281.6327 1288.0439 1288.8165 1290.9905 1297.5026 1298.8566 1312.5076 1334.4180 1349.1180 1353.1905 1356.2817 1358.7246 1372.8595 1374.3018 1389.6914 1430.6785 1446.9088 1454.6712 1458.8758 1459.0241 1461.9575 1462.8702 1465.5120 1467.2176 1470.6313 1475.2229 1477.1961 1479.9007 1484.3215 1487.8606 1489.0668 1618.3550 1648.0398 2948.8573 2949.2716 2950.9703 2951.6874 2954.5257 2956.5497 2961.0053 2965.6293 2967.8380 2970.9830 2979.4057 2981.7155 2985.1489 2990.0196 2992.2340 2996.3744 3003.7660 3003.9202 3014.4661 3014.8846 3025.1172 3034.6138 3041.9841 3049.4361 3063.8144 3067.2461 3069.8243 3078.8564 3125.1506 3127.5319
redmass: 3.0470 3.6354 4.9865 2.4012 4.1714 3.5767 2.2355 3.3398 3.3885 1.7744 2.7341 3.6523 1.8176 3.8457 2.3969 1.9373 1.1462 2.0725 3.0426 3.5282 4.0656 1.1060 3.6589 4.7452 3.4478 3.2813 2.6323 3.1703 3.0387 4.1077 3.0727 3.0778 3.5027 3.9468 5.1842 1.0585 1.0671 1.0812 1.1010 1.1311 1.2070 3.5526 1.2146 4.0331 1.2243 1.9130 2.0583 1.5398 2.8154 4.9130 1.1684 4.5656 2.0161 3.8747 1.1011 1.8106 3.4560 3.1800 2.6890 2.4651 2.1010 2.1727 2.4828 2.0188 3.2188 1.4331 1.8581 2.4495 1.5495 1.2763 1.8873 1.4297 1.3033 1.3029 1.2949 1.1907 1.0398 1.1898 1.3199 1.2736 1.1375 1.1242 1.1063 1.1135 1.3475 1.4037 1.5073 1.6871 1.6382 1.6100 1.5435 1.2748 1.2176 1.0885 1.0583 1.0719 1.0742 1.0735 1.0698 1.0711 1.0718 1.0821 1.0848 1.0835 1.0425 1.0855 1.0899 1.0914 1.0983 9.5947 7.8442 1.0585 1.0585 1.0590 1.0591 1.0591 1.0592 1.0590 1.0586 1.0584 1.0368 1.0381 1.0962 1.0972 1.0985 1.0601 1.1004 1.0594 1.0994 1.1041 1.0628 1.1048 1.1048 1.1045 1.1045 1.0943 1.1007 1.0992 1.1082 1.0993 1.1008
irintensity: 0.1814 1.0048 0.5428 0.3442 1.9496 2.2415 1.1987 0.7417 1.7868 0.1372 0.0582 0.6533 0.1800 0.6711 0.1238 0.1833 0.3230 0.0104 0.1644 3.3040 7.6342 0.0008 5.5217 3.7569 4.8449 1.2369 3.1283 4.2769 1.1802 7.0703 4.9091 0.4540 3.1861 14.8177 3.8706 18.7625 0.3922 6.9253 0.1754 2.4473 0.2227 6.8949 0.5762 6.8289 0.5719 7.7998 6.6510 10.0535 28.0343 0.1009 0.4526 9.5504 18.4010 8.2268 0.1329 9.4474 3.2563 9.9445 3.9705 4.0227 0.0141 3.9009 205.2694 107.1485 5.3469 2.3644 14.2904 343.9920 2.2138 15.6364 43.8699 3.5862 0.5593 0.0767 0.0769 0.1386 0.0963 29.8717 76.5971 29.3678 7.1690 0.5632 0.2970 0.0493 2.7185 1.2252 0.7860 0.1559 0.1853 0.2579 0.2436 84.6368 11.3212 17.1197 31.2287 26.2265 0.0038 0.0169 0.0268 0.0259 0.2115 0.2291 1.7527 0.2019 12.3401 2.2120 0.1698 3.2053 46.9341 252.7586 95.5934 0.0085 0.0864 0.0029 0.9982 0.1204 3.0362 7.5473 65.2649 244.7572 36.5892 6.7079 0.0415 0.0782 0.2155 17.5803 0.4953 32.9670 3.1200 0.0894 3.5960 6.7416 1.2755 206.7244 68.2587 5.8076 99.1624 55.3217 71.6289 6.0473 4.7470
temp: 298.150 k
press: 1.00000 atm
elementType: 8 8 8 6 6 6 6 6 6 6 6 6 6 6 6 6 6 6 6 1 1 1 1 1 1 1 1 1 1 1 1 1 1 1 1 1 1 1 1 1 1 1 1 1 1 1 1 1 1
symmnumber: 1
zpe: 1130811.4 jmol-1
zpe.correction: 0.430703 hartree
zpe.thermalcorrener: 0.454643 hartree
zpe.thermalcorrenthalpy: 0.455587 hartree
zpe.thermalcorrgfe: 0.372115 hartree
zpe.sumelectzpe: -851.822676 hartree
zpe.sumelectthermal: -851.798736 hartree
zpe.sumelectthermalent: -851.797792 hartree
zpe.sumelectthermalfe: -851.881265 hartree
dipole: -1.8116 -1.6738 -1.4400
dipole: 2.8561
quadrupole: -127.3262 -131.0039 -116.7944
quadrupole: -12.5891 -11.0445 -0.2366
quadrupole: -2.2847 -5.9624 8.2471 -12.5891 -11.0445 -0.2366
hfenergy: -852.2533797 hartree
pointgroup: C01[X(C16H30O3)]
dipole: -0.6955325 0.2740424 0.8388995 debye
polarizability: 255.572134|-2.0693493|160.5775259|-4.8826098|7.4520943|149.1666214 unknown
InChI: InChI=1S/C16H30O3/c1-3-4-5-6-7-8-9-10-11-12-13-19-16(18)14-15(2)17/h3-14H2,1-2H3
charge 0 multiplicity 1
49 atoms
O  4.337741 -0.79612 0.380054
O  5.808346 0.999422 0.592219
O  7.598708 -1.893209 -1.793156
C  -3.24405 -0.492219 0.102096
C  -4.504553 0.401723 0.110282
C  -1.928949 0.309013 0.23108
C  -5.822029 -0.390945 -0.044758
C  -0.665594 -0.580491 0.22037
C  -7.079247 0.507919 -0.035958
C  0.645696 0.229442 0.333721
C  -8.398138 -0.276899 -0.21691
C  1.906486 -0.667173 0.314421
C  -9.6528 0.626351 -0.206162
C  3.184665 0.161811 0.425979
C  -10.966202 -0.161519 -0.401725
C  5.604423 -0.23308 0.470766
C  6.680099 -1.310793 0.386482
C  7.622691 -1.09387 -0.824639
C  8.55715 0.099275 -0.753321
H  -3.221406 -1.084608 -0.836571
H  -3.309986 -1.227228 0.931491
H  -4.429007 1.147045 -0.709272
H  -4.535563 0.983041 1.055707
H  -1.866568 1.043149 -0.599459
H  -1.952104 0.902736 1.168919
H  -5.79191 -0.968987 -0.992207
H  -5.899976 -1.138682 0.772219
H  -0.646454 -1.179693 -0.713594
H  -0.721236 -1.308422 1.056311
H  -6.99191 1.265849 -0.842767
H  -7.117914 1.074474 0.918177
H  0.626214 0.826378 1.269299
H  0.69577 0.958942 -0.501279
H  -8.362011 -0.840214 -1.173047
H  -8.488461 -1.037126 0.587296
H  1.866488 -1.391644 1.150333
H  1.935128 -1.255975 -0.622276
H  -9.692412 1.182269 0.752982
H  -9.556384 1.391092 -1.003983
H  3.297736 0.876663 -0.409969
H  3.240709 0.727101 1.374674
H  -11.10045 -0.913554 0.398854
H  -11.846946 0.506804 -0.388374
H  -10.964907 -0.699708 -1.368557
H  6.2125 -2.30253 0.306077
H  7.282376 -1.250496 1.312899
H  9.334524 -0.08609 0.01414
H  8.003038 1.000232 -0.433249
H  9.046578 0.262445 -1.725413
