program: Gaussian 09
title: 000104166
version: EM64L-G09RevD.01
frameworkgroup: C1[X(C14H22O)]
method: RPBEPBE
basis: SDD
operation: Freq
keyword: #pfreq=noraman
keyword: PBEPBE/SDD
title: #p freq=noraman PBEPBE/SDD
converged: YES YES NO NO
title: Mulliken charges:
elementType: O C C C C C C C C C C C C C C H H H H H H H H H H H H H H H H H H H H H H
charge: -0.443508 -0.028604 -0.029488 -0.598123 -0.593606 0.557929 0.538835 -0.620576 -0.607983 -0.551027 -0.698205 -0.703765 -0.701058 -0.698710 0.298952 0.200098 0.199716 0.203551 0.209741 0.207622 0.207370 0.238043 0.225840 0.258987 0.229231 0.203878 0.210239 0.212359 0.231702 0.201233 0.233406 0.205046 0.209416 0.210286 0.227153 0.202931 0.351089
chargesum: 0.00000
title: Mulliken charges with hydrogens summed into heavy atoms:
elementType: O C C C C C C C C C C C C C C
charge: -0.092420 0.171493 0.170228 -0.184831 -0.178614 0.557929 0.538835 -0.382533 -0.382143 -0.292040 -0.054856 -0.058471 -0.053189 -0.058339 0.298952
polarizability: 1.83994315e+02 -1.78930309e+00 1.63843916e+02 -7.02087536e-01 1.34437767e+01 1.16355530e+02
1716.lowfreq: -0.0005 -0.0002 -0.0001 13.1687 13.6187 16.0964 40.9150 41.7583 73.3965
frequency: 39.9179 40.9506 73.3956 82.2942 90.6979 110.5107 211.1601 220.2710 222.5115 224.3646 235.2912 246.8123 249.8679 254.4277 271.7107 350.6849 355.5371 366.4525 367.8450 377.2348 442.9130 451.1729 479.7340 504.0540 518.7054 557.7170 648.7101 674.2791 728.0631 772.9962 779.2861 851.4960 872.0036 883.0711 891.5091 895.9978 922.2148 923.6721 933.9920 948.3708 960.7091 962.1887 978.2208 979.6453 987.0012 1086.4994 1088.3158 1097.3331 1099.4985 1139.4597 1168.3913 1177.8982 1191.5022 1193.4537 1224.8131 1229.1521 1269.4962 1271.4036 1297.3591 1307.3446 1329.7003 1330.9077 1346.4222 1359.6159 1374.4513 1377.4495 1391.7351 1393.2706 1394.6001 1446.8488 1465.8305 1467.1326 1468.1680 1469.0309 1469.9999 1475.0345 1482.2160 1484.8572 1486.3537 1488.8063 1490.7086 1602.5536 1622.8010 2956.9800 2957.3846 2969.0732 2969.9738 2971.6072 2972.2655 2980.2838 2981.3915 3031.3140 3033.2105 3061.4442 3062.4323 3065.9470 3066.8162 3070.4621 3070.9543 3075.8621 3076.8059 3102.7627 3121.5421 3154.5955 3580.8898
redmass: 2.9429 3.2904 3.0847 3.4692 2.9325 3.3568 2.1864 1.0701 1.6778 2.6530 3.4954 1.2065 2.0013 1.2572 2.5231 1.1239 2.2065 2.1380 2.0518 1.7853 3.0471 2.9123 2.3676 4.2466 6.5836 4.7135 3.4226 3.3489 2.0521 3.1934 2.9829 1.5678 1.6599 1.6110 1.5134 1.3935 1.3605 1.2258 2.0140 2.0423 1.5957 1.6450 2.4228 2.7056 5.5598 1.5597 1.5199 1.5821 1.5743 1.4125 1.5893 1.4405 1.8252 1.9122 1.2670 1.2396 1.5007 1.4930 1.4250 2.2838 1.5381 1.5365 1.3341 1.7440 1.2202 1.2232 1.3124 3.5487 1.2686 2.8896 1.0447 1.0486 1.0936 1.1002 1.0670 1.0793 1.2216 1.0563 1.0826 1.9458 1.0584 6.2525 6.3829 1.0785 1.0777 1.0353 1.0352 1.0386 1.0385 1.0620 1.0618 1.1023 1.1023 1.0996 1.0997 1.0987 1.0986 1.0997 1.0996 1.0991 1.0989 1.0910 1.0911 1.0922 1.0659
irintensity: 0.0312 0.0208 0.3293 0.3313 0.2084 0.3776 0.5878 0.1524 0.0841 2.4401 2.4705 1.2178 0.7708 0.0828 2.2657 134.1826 3.5550 0.4816 0.4045 0.0643 2.8531 0.3844 8.8074 3.0059 1.0018 2.5599 7.3645 6.7292 21.4243 1.1098 6.1784 22.0699 2.2428 31.0714 1.9963 0.7579 1.2362 9.0636 0.7332 11.6213 0.3798 0.2250 18.6600 7.6512 9.2053 2.5711 6.5751 18.8743 2.9561 151.9461 13.1109 19.5646 12.3915 1.9659 2.9385 4.3958 16.7902 17.6813 26.4972 3.5672 2.4398 1.1886 9.0315 14.8821 12.7404 28.7689 1.3867 6.9910 24.4181 40.4522 0.0676 6.1280 0.0343 6.2502 2.6871 1.9889 9.8059 17.1151 24.3310 5.3245 22.2933 106.0694 53.7095 21.7855 18.4715 35.1074 47.2753 24.2010 42.0035 65.0282 47.8637 18.6268 22.1678 21.3796 24.9681 11.5897 111.0959 0.6818 11.6386 153.8904 48.8801 19.6920 9.9554 4.5834 28.8386
temp: 298.150 k
press: 1.00000 atm
elementType: 8 6 6 6 6 6 6 6 6 6 6 6 6 6 6 1 1 1 1 1 1 1 1 1 1 1 1 1 1 1 1 1 1 1 1 1 1
symmnumber: 1
zpe: 851346.8 jmol-1
zpe.correction: 0.324261 hartree
zpe.thermalcorrener: 0.341136 hartree
zpe.thermalcorrenthalpy: 0.342080 hartree
zpe.thermalcorrgfe: 0.280260 hartree
zpe.sumelectzpe: -620.745607 hartree
zpe.sumelectthermal: -620.728731 hartree
zpe.sumelectthermalent: -620.727787 hartree
zpe.sumelectthermalfe: -620.789608 hartree
dipole: -1.5351 -0.7593 -0.0906
dipole: 1.7150
quadrupole: -85.4467 -92.4831 -95.8068
quadrupole: -6.8202 -1.6240 2.6194
quadrupole: 5.7988 -1.2376 -4.5612 -6.8202 -1.6240 2.6194
hfenergy: -621.0698676 hartree
pointgroup: C01 [X(C14H22O1)]
dipole: 0.5940387 0.3166009 -0.0462314 debye
polarizability: 184.1019663|-1.3313371|163.4695169|0.2962928|-13.890866|116.6222779 unknown
InChI: InChI=1S/C14H22O/c1-10(2)5-12-7-13(6-11(3)4)9-14(15)8-12/h7-11,15H,5-6H2,1-4H3
charge 0 multiplicity 1
37 atoms
O  0.040331 -3.514999 0.782118
C  3.119646 1.369705 0.050837
C  -3.173602 1.181172 0.133285
C  2.544431 0.433235 -1.067144
C  -2.571793 0.290286 -1.00828
C  1.247966 -0.289156 -0.723845
C  -1.230954 -0.361747 -0.696366
C  -0.011457 0.295541 -1.010873
C  1.277938 -1.571834 -0.119402
C  -1.179161 -1.641463 -0.094139
C  2.167393 2.541601 0.384202
C  3.503323 0.589264 1.329617
C  -3.495173 0.363878 1.406204
C  -2.276194 2.395214 0.467091
C  0.068781 -2.234931 0.191127
H  4.051055 1.801766 -0.373959
H  -4.133026 1.571232 -0.269351
H  3.326303 -0.311714 -1.315814
H  2.387922 1.049326 -1.974432
H  -3.3153 -0.494861 -1.248396
H  -2.468399 0.924067 -1.911277
H  -0.04474 1.276183 -1.501408
H  2.243654 -2.052085 0.091816
H  -2.093659 -2.193763 0.144907
H  1.221138 2.171187 0.81923
H  1.917775 3.128856 -0.519922
H  2.633359 3.226894 1.116713
H  3.980806 1.260099 2.067968
H  2.609486 0.144008 1.803538
H  4.214752 -0.2286 1.105016
H  -2.573902 -0.050241 1.854731
H  -4.172723 -0.481982 1.182185
H  -3.986892 1.000879 2.165077
H  -2.766001 3.048562 1.213099
H  -1.307321 2.067539 0.886551
H  -2.06785 3.003524 -0.433641
H  0.95949 -3.847644 0.934639
