program: Gaussian 09
title: 000104160
version: EM64L-G09RevD.01
frameworkgroup: C1[X(C8H16O5)]
method: RPBEPBE
basis: SDD
operation: Freq
keyword: #pfreq=noraman
keyword: PBEPBE/SDD
title: #p freq=noraman PBEPBE/SDD
converged: YES YES NO NO
title: Mulliken charges:
elementType: O O O O O C C C C C C C C H H H H H H H H H H H H H H H H
charge: -0.277489 -0.308978 -0.256278 -0.446347 -0.251279 -0.260542 -0.261416 -0.242941 -0.267431 -0.246503 -0.318487 0.297681 -0.750567 0.202777 0.201025 0.210871 0.205049 0.188932 0.206564 0.220113 0.249322 0.192432 0.209131 0.209485 0.202027 0.349529 0.250804 0.247370 0.245147
chargesum: 0.00000
title: Mulliken charges with hydrogens summed into heavy atoms:
elementType: O O O O O C C C C C C C C
charge: -0.277489 -0.308978 -0.256278 -0.096818 -0.251279 0.143260 0.154503 0.152554 0.202004 0.155060 0.093025 0.297681 -0.007246
polarizability: 1.35215109e+02 6.89123659e-01 9.68872696e+01 2.33640342e+00 -8.79128052e-01 8.72927598e+01
1716.lowfreq: -10.8218 -0.0008 -0.0005 -0.0005 1.4837 3.4589 15.5535 19.4084 27.1399
frequency: 15.3721 19.2677 26.8693 49.2835 59.1848 72.6976 81.0075 95.2302 122.7893 145.8528 171.7915 181.3567 214.1510 253.1299 295.8135 363.4670 397.9894 415.7207 465.3086 508.1756 533.0960 566.6588 613.4993 788.3281 804.6801 833.8259 849.7788 871.6283 918.0823 977.1140 991.0258 1008.2060 1021.6263 1026.8728 1044.7023 1063.2425 1077.0793 1089.3889 1105.2473 1115.7923 1122.1334 1170.9269 1191.0340 1202.0956 1205.3514 1209.3360 1250.5199 1257.2372 1309.3107 1328.4601 1345.8835 1359.2977 1383.1516 1384.6130 1389.8197 1420.0988 1452.2504 1454.8073 1457.6194 1459.7906 1461.9103 1462.0705 1485.5990 1494.2755 1647.9971 2927.9933 2938.5857 2941.4564 2955.1160 2967.5076 2984.1704 2987.7496 3003.3430 3006.5866 3019.7094 3021.4238 3082.2966 3087.6488 3100.3482 3140.0129 3536.4450
redmass: 5.7274 5.2007 3.9594 4.7801 1.0417 3.0335 2.2182 4.1132 3.8755 4.0508 4.2215 3.7014 2.6091 2.8977 2.5606 3.5795 3.0297 2.9348 1.1753 3.0660 2.7179 3.0932 4.3635 3.0911 2.7045 1.1218 2.3233 2.7243 5.2964 2.4453 1.7546 3.0895 3.8342 2.8112 1.6623 3.1404 4.0705 1.9566 2.6309 1.8101 2.0845 1.1299 1.2036 1.1088 3.6944 1.2264 1.1021 1.1468 1.1891 1.2054 1.2717 1.3694 1.2504 1.2567 1.4824 1.5676 1.0693 1.0648 1.0593 1.0879 1.0883 1.0897 1.0750 1.0816 9.6920 1.0574 1.0551 1.0557 1.0546 1.0716 1.1015 1.1049 1.1029 1.0382 1.0603 1.1101 1.0963 1.1060 1.0941 1.1025 1.0652
irintensity: 2.2211 1.4865 3.2791 0.1675 0.4701 0.6080 1.9552 2.0635 5.7430 18.6650 8.4901 6.4436 2.3116 2.3708 2.7289 15.3830 4.8231 4.5167 163.4490 22.6854 4.1430 3.0292 2.9454 11.3569 20.5896 0.9287 4.1929 18.4706 37.9277 30.2875 28.7489 29.0258 54.9907 120.0776 13.7136 12.1481 239.8229 11.7475 29.5335 2.8977 18.1896 3.1484 8.4257 5.9175 359.5745 24.0339 5.3001 0.0251 23.1306 10.7401 0.6773 0.8267 46.3472 23.7779 15.4291 0.9093 6.0478 31.6315 16.7376 20.4006 6.6367 6.8082 0.0191 7.9140 211.4415 46.8744 57.3968 41.3011 86.2821 30.8529 42.9404 0.6790 98.2544 2.0167 30.4020 88.3302 37.1921 20.2957 9.8082 9.6569 8.4370
temp: 298.150 k
press: 1.00000 atm
elementType: 8 8 8 8 8 6 6 6 6 6 6 6 6 1 1 1 1 1 1 1 1 1 1 1 1 1 1 1 1
symmnumber: 1
zpe: 627204.0 jmol-1
zpe.correction: 0.238889 hartree
zpe.thermalcorrener: 0.255311 hartree
zpe.thermalcorrenthalpy: 0.256255 hartree
zpe.thermalcorrgfe: 0.190019 hartree
zpe.sumelectzpe: -689.447523 hartree
zpe.sumelectthermal: -689.431102 hartree
zpe.sumelectthermalent: -689.430157 hartree
zpe.sumelectthermalfe: -689.496394 hartree
dipole: -0.0428 -0.8770 -0.0336
dipole: 0.8786
quadrupole: -102.8592 -73.2154 -76.8917
quadrupole: 11.5461 -19.6581 4.4494
quadrupole: -18.5371 11.1067 7.4304 11.5461 -19.6581 4.4494
hfenergy: -689.6864126 hartree
pointgroup: C01 [X(C8H16O5)]
dipole: 0.0149925 0.3423265 0.0456748 debye
polarizability: 135.218706|1.260692|96.3269782|-2.0263518|2.4295095|87.8494544 unknown
InChI: InChI=1S/C8H16O5/c1-8(10)13-7-6-12-5-4-11-3-2-9/h9H,2-7H2,1H3
charge 0 multiplicity 1
29 atoms
O  -0.359786 0.735421 0.297819
O  3.272762 0.247705 0.157117
O  -3.1105 -0.161654 -0.466546
O  5.472206 -0.894195 -1.202666
O  -5.064174 -0.069351 0.79918
C  0.999853 0.922072 -0.216398
C  1.908079 0.063857 0.662588
C  -1.350671 1.508695 -0.453074
C  -2.727383 1.167018 0.086363
C  4.275085 -0.516289 0.920293
C  5.587686 -0.352026 0.153615
C  -4.323658 -0.68381 -0.002104
C  -4.568177 -2.061489 -0.577403
H  1.068991 0.594855 -1.275983
H  1.305852 1.988862 -0.156117
H  1.605739 -1.002535 0.601205
H  1.835155 0.391723 1.720664
H  -1.164515 2.598377 -0.319335
H  -1.294165 1.273968 -1.537889
H  -3.480557 1.911423 -0.230637
H  -2.721853 1.116342 1.189101
H  4.357929 -0.121275 1.956252
H  3.980283 -1.586843 0.96031
H  6.394295 -0.922891 0.643266
H  5.867894 0.722159 0.129709
H  4.639339 -0.512737 -1.585805
H  -4.098874 -2.81795 0.078033
H  -4.122247 -2.157776 -1.579268
H  -5.649885 -2.260857 -0.613491
