program: Gaussian 09
title: 000104156
version: EM64L-G09RevD.01
frameworkgroup: C1[X(C12H18O)]
method: RPBEPBE
basis: SDD
operation: Freq
keyword: #pfreq=noraman
keyword: PBEPBE/SDD
title: #p freq=noraman PBEPBE/SDD
converged: YES YES NO NO
title: Mulliken charges:
elementType: O C C C C C C C C C C C C H H H H H H H H H H H H H H H H H H
charge: -0.276751 0.131431 0.556562 -0.701655 -0.701852 -0.746894 -0.639791 -0.576858 0.462795 0.344055 -0.534372 -0.824476 -0.536691 0.205526 0.217530 0.222774 0.217565 0.205542 0.222765 0.214683 0.218157 0.218180 0.230790 0.269926 0.243281 0.225801 0.224541 0.227988 0.218596 0.218636 0.242215
chargesum: 0.00000
title: Mulliken charges with hydrogens summed into heavy atoms:
elementType: O C C C C C C C C C C C C
charge: -0.276751 0.131431 0.556562 -0.055825 -0.055981 -0.095875 -0.409001 -0.306931 0.462795 0.344055 -0.291091 -0.146146 0.142756
polarizability: 1.71345752e+02 -1.73767346e+00 1.43468976e+02 1.92877876e-02 5.94803238e-02 8.89754452e+01
1716.lowfreq: -3.8464 -0.0010 -0.0009 -0.0008 7.2415 11.2685 34.3770 39.4656 82.6860
frequency: 34.0341 39.0419 82.6595 127.0705 157.7008 183.4338 207.1084 209.9315 230.0419 256.4804 265.4855 275.3355 301.0004 307.5910 315.9826 375.6405 384.8262 401.8807 499.0635 519.1953 532.4983 553.9017 570.4922 623.4480 715.0944 778.4559 846.8490 880.1709 884.8364 894.6995 919.2182 926.9191 938.4044 941.9475 981.9892 996.0167 1017.7120 1024.5989 1038.5052 1046.6001 1112.8723 1126.2770 1158.8755 1167.1444 1205.9410 1216.1043 1230.8612 1287.5213 1303.5145 1373.0461 1373.8854 1388.8398 1395.8750 1402.0929 1422.6422 1443.8309 1455.2575 1458.7023 1464.5659 1466.2835 1468.4307 1470.3753 1476.4936 1478.5396 1484.0350 1486.3351 1497.8302 1600.3620 1617.2882 2954.6790 2971.1445 2971.6796 2973.5333 2977.5603 3040.2358 3050.7545 3065.5705 3066.3162 3070.8968 3075.1606 3078.3809 3081.4290 3082.6415 3119.8620 3126.6621 3144.5090 3174.0236
redmass: 1.6291 1.4331 3.0837 3.0635 3.4418 1.9229 2.7986 1.0453 2.1163 1.0710 1.8285 2.8090 1.1132 2.6044 2.5123 2.7627 2.4585 3.0745 4.5501 3.4552 3.5758 3.4490 3.7750 4.0937 2.0118 3.9638 1.4432 3.4700 1.4870 1.5075 1.6860 2.2067 2.5318 1.2014 4.3971 1.9072 1.4590 1.3851 2.7811 1.5484 1.2608 1.4901 1.3989 1.7081 2.9971 2.7498 2.5022 1.2701 5.1470 1.2191 1.1862 4.8299 1.2712 1.2677 1.8742 1.4118 2.2354 1.0508 1.0503 1.0482 1.0574 1.0473 1.1354 1.0651 1.0510 1.2684 1.0905 5.8037 6.4605 1.0331 1.0347 1.0348 1.0372 1.0358 1.1036 1.0976 1.1002 1.0999 1.1006 1.0986 1.0994 1.0990 1.0985 1.0990 1.0899 1.0907 1.0908
irintensity: 0.0494 0.4387 7.4953 0.2390 1.6382 0.0122 0.7633 0.0174 2.0885 0.0506 0.5209 0.0098 0.0007 1.4986 0.6772 2.3176 0.0454 0.4861 2.6131 0.1158 0.0525 0.8069 8.2724 0.0104 18.4914 1.5788 26.7555 9.2860 7.8592 14.4054 5.1170 2.0250 15.6667 0.2236 2.1385 5.1635 5.5526 0.3222 89.4923 11.2248 0.2521 11.7124 8.1675 63.7026 6.6610 4.1536 24.2808 0.6310 97.3869 18.1213 18.7710 35.1197 14.0288 4.3107 23.6741 12.4426 18.9212 0.0036 11.2904 0.0165 1.1652 13.6207 16.8042 20.4330 11.9330 17.4548 27.1068 128.5677 75.4702 69.5206 34.5015 29.4949 46.0533 29.5402 50.7358 23.0801 6.0947 3.0460 13.1452 123.1772 36.3224 50.7999 20.4711 29.7297 19.3615 11.0390 2.4220
temp: 298.150 k
press: 1.00000 atm
elementType: 8 6 6 6 6 6 6 6 6 6 6 6 6 1 1 1 1 1 1 1 1 1 1 1 1 1 1 1 1 1 1
symmnumber: 1
zpe: 701877.3 jmol-1
zpe.correction: 0.267331 hartree
zpe.thermalcorrener: 0.282009 hartree
zpe.thermalcorrenthalpy: 0.282953 hartree
zpe.thermalcorrgfe: 0.226033 hartree
zpe.sumelectzpe: -542.287225 hartree
zpe.sumelectthermal: -542.272547 hartree
zpe.sumelectthermalent: -542.271602 hartree
zpe.sumelectthermalfe: -542.328523 hartree
dipole: 1.1493 1.0311 0.0106
dipole: 1.5441
quadrupole: -65.6607 -78.7386 -83.3941
quadrupole: 0.9212 0.0108 0.0281
quadrupole: 10.2705 -2.8075 -7.4630 0.9212 0.0108 0.0281
hfenergy: -542.5545557 hartree
pointgroup: C01 [X(C12H18O1)]
dipole: 0.4528899 0.404868 0.004994 debye
polarizability: 171.3380039|-1.7876144|143.4753242|0.3394663|-0.0695646|88.976845 unknown
InChI: InChI=1S/C12H18O/c1-9-6-10(12(2,3)4)8-11(7-9)13-5/h6-8H,1-5H3
charge 0 multiplicity 1
31 atoms
O  2.424024 -1.770384 0.014771
C  -2.342536 -0.368451 -0.007278
C  -0.831878 -0.030437 -0.002494
C  -3.001799 0.236499 -1.283796
C  -3.012209 0.247297 1.258589
C  -2.6082 -1.895587 -0.001861
C  -0.41526 1.333915 -0.006122
C  0.163174 -1.028509 0.00483
C  0.948213 1.694733 -0.001461
C  1.537028 -0.676941 0.008558
C  1.938716 0.675301 0.005213
C  1.3708 3.155443 0.000915
C  3.856911 -1.476377 0.018601
H  -4.087204 0.021615 -1.291574
H  -2.871482 1.332358 -1.330166
H  -2.555283 -0.195843 -2.197972
H  -2.882324 1.343529 1.296665
H  -4.097648 0.032392 1.259406
H  -2.573142 -0.177085 2.180077
H  -3.697833 -2.082578 -0.005184
H  -2.180556 -2.388161 -0.894556
H  -2.187247 -2.380589 0.898139
H  -1.167565 2.131474 -0.012332
H  -0.084668 -2.092766 0.007327
H  2.997471 0.955345 0.007609
H  2.036125 3.384525 -0.85289
H  0.497593 3.827093 -0.063048
H  1.925283 3.412503 0.923727
H  4.150468 -0.905468 0.921688
H  4.156623 -0.912214 -0.886707
H  4.353406 -2.458134 0.023926
