program: Gaussian 09
title: 000104139
version: EM64L-G09RevD.01
frameworkgroup: C1[X(C7H5I3O2)]
method: RPBEPBE
basis: SDD
operation: Freq
keyword: #pfreq=noraman
keyword: PBEPBE/SDD
title: #p freq=noraman PBEPBE/SDD
converged: YES YES NO NO
title: Mulliken charges:
elementType: I I I O O C C C C C C C H H H H H
charge: 0.154306 0.125984 0.178072 -0.396073 -0.393633 0.691939 -0.805509 -0.787220 0.667743 0.705516 -0.769842 -0.810395 0.249267 0.239212 0.264296 0.344419 0.341920
chargesum: 0.00000
title: Mulliken charges with hydrogens summed into heavy atoms:
elementType: I I I O O C C C C C C C
charge: 0.154306 0.125984 0.178072 -0.051655 -0.051713 0.691939 -0.805509 -0.787220 0.667743 0.705516 -0.769842 -0.057620
polarizability: 2.17638334e+02 1.27798375e+00 2.10882729e+02 -5.11792990e-02 -2.14906084e-01 4.82639060e+01
1716.lowfreq: -99.5128 -6.3861 -5.2514 -0.0006 -0.0005 -0.0005 1.7866 66.7467 70.1908
frequency: -99.5030 66.7448 70.1876 72.9497 94.4151 103.3463 162.3699 197.4191 238.8998 240.3011 264.3862 309.0277 329.3602 373.3830 380.4410 438.2512 458.2218 571.7956 586.0260 595.8576 611.8036 625.8616 650.0198 787.6453 985.8815 993.5556 1009.8339 1035.4560 1052.5073 1184.3119 1195.5106 1337.6325 1348.3347 1394.4527 1401.4753 1418.8407 1462.6346 1470.4695 1551.3755 1567.6045 2987.9664 3076.6777 3111.3593 3417.8121 3430.2920
redmass: 1.0961 4.7896 9.0239 9.2525 51.4876 41.1883 105.7886 5.1497 10.1404 9.7233 5.1526 6.1062 9.6163 2.9684 5.4149 1.1194 1.1139 6.3388 5.3441 7.4125 7.8267 5.3624 11.1449 8.6710 2.3393 6.6095 10.2148 1.5378 2.7658 1.4336 1.5693 10.8697 6.5100 2.4819 1.6037 3.4697 1.1293 1.0705 7.4112 7.2637 1.0415 1.0921 1.0991 1.0647 1.0647
irintensity: 0.4557 0.0662 0.5813 0.3101 0.1592 0.0538 0.0446 6.0047 1.6520 2.4070 0.9928 0.0240 3.6723 3.0475 19.7938 101.5660 150.9125 3.7407 0.8208 49.3576 20.8787 21.2996 0.0929 20.5643 6.6781 11.0594 1.0984 10.5094 71.0328 334.0239 166.1404 56.7692 41.5023 45.1442 39.8738 31.5631 38.1077 24.4308 23.8194 14.1992 10.9917 11.4837 4.9841 81.9414 88.8442
temp: 298.150 k
press: 1.00000 atm
elementType: 53 53 53 8 8 6 6 6 6 6 6 6 1 1 1 1 1
symmnumber: 1
zpe: 267142.3 jmol-1
zpe.correction: 0.101749 hartree
zpe.thermalcorrener: 0.114374 hartree
zpe.thermalcorrenthalpy: 0.115318 hartree
zpe.thermalcorrgfe: 0.058509 hartree
zpe.sumelectzpe: -453.821575 hartree
zpe.sumelectthermal: -453.808951 hartree
zpe.sumelectthermalent: -453.808007 hartree
zpe.sumelectthermalfe: -453.864816 hartree
dipole: 1.6530 -0.5430 0.0428
dipole: 1.7404
quadrupole: -108.9333 -102.9995 -117.2471
quadrupole: -5.4213 -0.0513 0.0469
quadrupole: 0.7933 6.7271 -7.5204 -5.4213 -0.0513 0.0469
hfenergy: -453.9233246 hartree
pointgroup: C01 [X(C7H5I3O2)]
dipole: -0.2403477 0.6408664 -0.0192371 debye
dipolederiv: -0.0420484 -0.2088004 -0.0062374 -0.1756988 -0.3511821 -0.0004991 -0.0014487 -0.015481 0.0377441 -0.2005101 0.1754395 -0.009677 0.1966536 -0.3812854 0.0005324 -0.0069286 0.0152715 0.0399198 -0.4339869 -0.0699761 -0.00554 -0.0210964 -0.0345478 -0.0011238 -0.0007052 -0.0011031 0.0810006 -0.4386486 -0.4883172 -0.0006989 -0.3169204 -1.1030151 0.0029526 0.0009387 0.0020378 -0.379703 -0.6007889 0.4529809 -0.0014042 0.5849741 -0.9061758 0.0020472 0.0037047 0.0003547 -0.3763169 0.1725517 0.0528743 -0.0016978 -0.047752 -0.172248 -0.0021361 0.0278694 -0.0042477 0.1458911 -0.1395963 0.6591649 0.0253462 0.4397338 0.612684 0.0312 0.0213563 0.0369158 -0.2769131 -0.1004298 -0.6864865 0.0252171 -0.4131422 0.5971204 -0.0304537 0.0276068 -0.0418874 -0.2817274 0.097266 0.5695668 -0.0046045 0.3089961 0.6969419 0.0060771 -0.0118916 0.0090418 0.2347213 0.2579551 -0.5978035 -0.0014 -0.560003 0.5671121 -0.0098134 -0.0114278 -0.009373 0.2265897 0.8203275 0.0340413 0.0015468 0.0242404 -0.3883934 0.0004784 0.0033068 0.0009997 -0.2815865 -0.186211 -0.0078428 -0.001504 -0.0087174 -0.0079584 0.0032577 -0.0571579 0.0113457 0.0408422 0.0721009 -0.0387923 0.0026831 -0.0956795 0.0045287 0.0941286 0.0393957 0.0622211 0.078763 0.0617054 0.0329603 0.0091814 0.0927345 -0.025388 -0.0959205 0.0358864 -0.0682731 0.0750383 0.0036219 0.0018531 -0.0377822 0.0040155 0.1212765 -0.0009397 -0.0716475 0.0008039 -0.0663993 0.3888278 0.1122818 0.0050805 0.0445572 0.3362477 0.0003784 0.0023227 0.0025487 0.3525834 0.2678638 0.0068559 0.0014906 -0.0568955 0.4342825 -0.0001661 -0.0011803 -0.0011754 0.3495527 unknown
polarizability: 210.7673511|0.9916302|217.7330158|1.8461674|0.0707676|48.2846023 unknown
InChI: InChI=1S/C7H5I3O2/c1-2-3(8)6(11)5(10)7(12)4(2)9/h11-12H,1H3
charge 0 multiplicity 1
17 atoms
I  -1.646765 -3.136954 -0.049139
I  -1.726276 3.129145 -0.049874
I  3.554489 0.057279 0.017395
O  1.45686 2.414839 -0.003071
O  1.376504 -2.430753 -0.0024
C  -1.449475 -0.00597 0.018182
C  -0.6978 -1.212508 0.007387
C  -0.715463 1.212175 0.008458
C  0.706044 1.249158 0.004083
C  0.72299 -1.209217 0.004839
C  1.414504 0.027024 0.010099
C  -2.963737 -0.020946 0.028021
H  -3.347642 -0.922048 0.530895
H  -3.374094 0.864921 0.537915
H  -3.361853 -0.02675 -1.0051
H  0.863255 3.216171 -0.008356
H  2.36536 -2.295265 -0.002333
