program: Gaussian 09
title: 000104186
version: EM64L-G09RevD.01
frameworkgroup: C1[X(C20H16N4O2)]
method: RPBEPBE
basis: SDD
operation: Freq
keyword: #p
keyword: freq=noraman
keyword: PBEPBE/SDD
title: #p freq=noraman PBEPBE/SDD
converged: YES YES NO NO
title: Mulliken charges:
elementType: O O N N N N C C C C C C C C C C C C C C C C C C C C H H H H H H H H H H H H H H H H
charge: -0.307619 -0.289463 -0.401278 -0.645104 0.004106 0.011599 0.121453 0.166155 0.110241 -0.349737 -0.160751 0.284964 0.294143 -0.041855 -0.174266 -0.427573 0.230755 0.245373 -0.353405 -0.385204 -0.380488 -0.682711 -0.226890 -0.227166 -0.282102 -0.301500 0.238166 0.248769 0.391713 0.210200 0.207987 0.198039 0.218825 0.294696 0.294499 0.213357 0.221324 0.208111 0.240634 0.241119 0.344078 0.396807
chargesum: 0.00000
title: Mulliken charges with hydrogens summed into heavy atoms:
elementType: O O N N N N C C C C C C C C C C C C C C C C C C C C
charge: -0.307619 -0.289463 -0.009565 0.095782 0.004106 0.011599 0.121453 0.166155 0.110241 0.137197 -0.160751 0.284964 0.294143 -0.041855 -0.174266 -0.009386 0.230755 0.245373 0.063459 -0.090508 -0.085989 -0.039919 0.013744 0.013953 -0.282102 -0.301500
polarizability: 4.21106785e+02 -7.70103415e+01 3.87369661e+02 7.86398921e+00 8.28778314e+00 1.12746852e+02
1716.lowfreq: -0.0007 -0.0003 0.0008 3.8459 6.8112 8.3668 16.1351 39.6175 42.0239
frequency: 15.8885 39.6058 42.0057 57.1231 66.3469 83.0674 102.4190 115.4389 123.6136 139.5885 152.0573 157.6338 182.7310 215.4226 220.9786 227.0530 249.6420 263.1776 285.7785 296.8278 330.2576 346.8463 349.1577 371.8289 404.5620 415.0040 424.8870 434.2001 444.0229 477.2906 481.5177 497.9029 502.0444 519.9342 544.9961 567.1262 603.5138 606.3147 618.3597 674.6426 701.2010 701.6577 717.3194 741.4042 742.3929 753.9977 807.8420 825.1251 830.8484 845.9719 848.8729 870.1143 888.4808 893.6925 935.4329 937.7951 951.8369 971.3970 998.5045 1004.7069 1015.3915 1031.2534 1040.0621 1050.3933 1094.5553 1097.1629 1120.4744 1143.4917 1150.3437 1164.1725 1173.1760 1212.6744 1224.5935 1257.7749 1265.4151 1283.2589 1295.3390 1314.1067 1326.6806 1347.7497 1358.3086 1366.0906 1369.8533 1387.6725 1391.8651 1403.6443 1412.6157 1446.1258 1450.6959 1463.2397 1471.8238 1474.1689 1475.5886 1478.4361 1488.0680 1517.0539 1523.6678 1562.1145 1590.8960 1606.7918 1608.8095 1613.8764 2157.6803 2164.9392 2972.5960 2975.2199 2976.2187 2981.5872 3016.0868 3019.1614 3033.9404 3046.8629 3072.9171 3077.4199 3138.4384 3155.2187 3168.8374 3176.1660 3235.6979 3586.9430
redmass: 5.7314 4.8521 4.5204 9.5714 2.0168 2.7212 6.5219 6.7057 6.1323 4.9706 6.8119 7.7939 5.5723 8.1032 1.3046 4.7161 2.6573 2.1762 4.6119 8.7430 5.4821 7.7286 5.4045 10.0410 6.2465 7.3480 3.4273 7.4831 5.8306 5.1258 5.0467 7.2562 8.0842 9.7814 8.3439 1.1997 4.6453 7.0247 7.2002 6.9278 6.0045 5.6986 6.9036 2.1694 1.3548 4.9668 1.8525 1.6769 4.3218 1.1229 1.9277 4.5032 3.5576 1.1389 2.0819 3.4933 1.4373 3.9285 1.3867 2.5381 1.3629 2.1961 4.7385 3.6878 2.7856 2.2245 2.0120 2.1255 2.1481 2.5649 1.1957 2.3851 1.2805 1.3310 1.9358 2.2838 1.4125 1.3693 2.1230 3.6522 1.9981 1.6935 3.1134 9.9326 1.2147 5.1781 8.4296 5.3502 2.9014 1.0924 1.2554 2.0188 1.0608 1.0434 1.0871 6.9526 7.9800 2.6779 2.0583 6.8068 7.2849 1.8051 12.6263 12.6192 1.0571 1.0465 1.0539 1.0611 1.0884 1.0928 1.1021 1.1030 1.1012 1.0993 1.0866 1.0909 1.0945 1.0994 1.0633 1.0895
irintensity: 0.6601 0.4293 0.4125 0.0119 1.3346 2.3248 5.9949 1.2892 2.3677 1.0289 0.0403 3.2845 0.2541 0.5387 0.6426 1.6436 0.5695 1.4014 0.0700 4.0385 4.5060 0.2869 0.1817 0.4089 4.3413 0.0887 0.6352 19.8520 15.2152 0.9614 2.8677 0.4647 0.1703 4.4985 5.9536 128.3239 4.4385 0.3806 5.6254 6.2245 0.8878 1.3899 4.4036 14.8836 14.1560 4.5034 49.8536 3.0973 4.1283 129.6353 10.9770 1.5554 0.9397 86.8217 0.1501 55.1203 14.0513 33.8069 4.7631 6.7132 0.0012 9.0140 0.4838 8.8345 15.2355 11.9501 4.3426 3.8921 6.8877 4.0230 15.1156 0.6165 2.4189 21.8113 11.8771 167.9632 137.9600 99.8235 330.0096 22.6130 161.3144 15.0472 108.6326 8.9844 13.0523 46.7557 18.5543 37.7841 4.6622 7.0641 63.4248 28.2460 2.2962 13.4244 19.3429 200.8997 360.3007 23.9681 169.4100 25.5342 7.0901 110.9614 63.2700 7.4575 6.7629 33.9785 18.9519 63.1652 11.6532 3.1764 22.8189 27.0333 77.8320 40.9283 4.0289 13.7212 1.2496 30.0086 46.4516 81.6448
temp: 298.150 k
press: 1.00000 atm
elementType: 8 8 7 7 7 7 6 6 6 6 6 6 6 6 6 6 6 6 6 6 6 6 6 6 6 6 1 1 1 1 1 1 1 1 1 1 1 1 1 1 1 1
symmnumber: 1
zpe: 835261.5 jmol-1
zpe.correction: 0.318134 hartree
zpe.thermalcorrener: 0.340909 hartree
zpe.thermalcorrenthalpy: 0.341853 hartree
zpe.thermalcorrgfe: 0.265157 hartree
zpe.sumelectzpe: -1139.403677 hartree
zpe.sumelectthermal: -1139.380902 hartree
zpe.sumelectthermalent: -1139.379958 hartree
zpe.sumelectthermalfe: -1139.456655 hartree
dipole: 2.6393 -4.8979 -0.1376
dipole: 5.5655
quadrupole: -146.6155 -163.7830 -152.7680
quadrupole: 11.8094 0.5911 -0.0503
quadrupole: 7.7734 -9.3942 1.6208 11.8094 0.5911 -0.0503
hfenergy: -1139.7218115 hartree
pointgroup: C01 [X(C20H16N4O2)]
dipole: -1.5410391 1.5546327 -0.0528711 debye
polarizability: 460.3622583|-55.2400251|348.5545833|0.7847357|-6.3117807|112.3064563 unknown
InChI: InChI=1S/C20H16N4O2/c1-2-3-8-24-18-14(10-22)13(9-21)17(23)15-16(18)20(26)12-7-5-4-6-11(12)19(15)25/h4-7,24H,2-3,8,23H2,1H3
charge 0 multiplicity 1
42 atoms
O  -0.490487 2.344763 -0.153042
O  -2.922926 -2.607456 0.109441
N  1.8259 1.283868 -0.150743
N  -0.648506 -3.796829 0.141063
N  4.649247 -1.338562 -0.004326
N  2.705382 -4.70447 0.168563
C  -0.201901 -0.065602 -0.046294
C  -0.84984 -1.350178 0.024489
C  1.2546 0.045208 -0.072296
C  3.251072 1.661391 -0.205611
C  -1.021934 1.159208 -0.09306
C  -2.497836 1.047559 -0.069409
C  -3.132204 -0.223602 -0.001481
C  -0.068386 -2.559349 0.075415
C  -2.324208 -1.461123 0.047725
C  3.385069 3.193986 -0.325002
C  2.022359 -1.185569 -0.011118
C  1.369442 -2.441956 0.058752
C  2.881654 3.977787 0.910893
C  -3.288463 2.225381 -0.115423
C  -4.54831 -0.307174 0.019879
C  3.106285 5.498241 0.766101
C  -4.692261 2.135255 -0.094086
C  -5.324901 0.864857 -0.026295
C  3.45827 -1.217758 -0.012126
C  2.132592 -3.65462 0.117458
H  3.778283 1.315059 0.704544
H  3.741441 1.177789 -1.07193
H  1.105475 2.047572 -0.178477
H  2.851038 3.542129 -1.232546
H  4.457163 3.421769 -0.484407
H  3.408432 3.606788 1.813338
H  1.803699 3.783439 1.074655
H  -2.775587 3.190018 -0.167431
H  -5.006323 -1.299174 0.072961
H  2.565569 5.896592 -0.112903
H  2.747022 6.043215 1.657595
H  4.179767 5.732219 0.635971
H  -5.299497 3.045954 -0.129928
H  -6.417912 0.79919 -0.009989
H  -0.075877 -4.640301 0.178664
H  -1.685403 -3.810213 0.152216
