program: Gaussian 09
title: 000104184
version: EM64L-G09RevD.01
frameworkgroup: C1[X(C23H18N4O2)]
method: RPBEPBE
basis: SDD
operation: Freq
keyword: #p
keyword: freq=noraman
keyword: PBEPBE/SDD
title: #p freq=noraman PBEPBE/SDD
converged: YES YES NO NO
title: Mulliken charges:
elementType: O O N N N N C C C C C C C C C C C C C C C C C C C C C C C H H H H H H H H H H H H H H H H H H
charge: -0.257229 -0.207826 -0.326595 -0.167442 -0.041859 -0.027758 0.244345 0.017070 0.196305 0.452467 0.327743 0.151929 -0.442815 0.489232 -0.000616 0.013426 0.033850 -0.534880 -0.449482 -0.391071 -0.370234 -0.381417 -0.361309 -0.349506 -0.218499 -0.663345 -0.660666 -0.227810 -0.204728 0.297115 0.282783 0.247637 0.241267 0.225689 0.217503 0.219487 0.236280 0.296217 0.250815 0.225262 0.242627 0.224529 0.247728 0.218469 0.229475 0.228255 0.227580
chargesum: 0.00000
title: Mulliken charges with hydrogens summed into heavy atoms:
elementType: O O N N N N C C C C C C C C C C C C C C C C C C C C C C C
charge: -0.257229 -0.207826 -0.326595 -0.167442 -0.041859 -0.027758 0.244345 0.017070 0.196305 0.452467 0.327743 0.151929 -0.145700 0.489232 -0.000616 0.013426 0.033850 -0.252097 -0.201845 -0.149804 0.072958 0.074351 -0.065091 -0.098691 0.009755 0.029073 0.035006 -0.000230 -0.204728
polarizability: 7.30275038e+02 -1.59930235e+01 3.26633809e+02 -1.22929385e+01 1.31286612e+00 1.26472620e+02
1716.lowfreq: -3.8571 -0.0004 0.0004 0.0008 1.2155 6.2331 23.0064 27.7138 53.6993
frequency: 22.8780 27.6211 53.6737 61.6938 68.0183 79.8513 102.1518 108.9241 114.6044 119.7206 131.4164 163.3794 189.7994 204.7954 213.1543 216.1594 228.4098 262.2248 268.8787 277.8398 304.2209 312.5564 344.6749 369.8219 377.6074 395.8186 417.2453 422.7448 437.9941 451.4766 461.6356 475.6609 488.2747 508.5968 530.1568 538.1817 579.0660 580.1057 602.7997 604.8432 631.8139 634.1556 668.5367 672.0835 687.5927 713.5267 734.1975 761.4895 762.8632 776.1791 777.1428 777.7616 786.3055 808.7569 813.3284 823.1866 854.3001 869.3186 877.8503 898.2570 919.1789 934.8358 942.0153 957.1392 963.5155 988.3144 1001.0546 1020.9416 1022.4534 1034.7784 1066.7087 1085.8318 1087.6837 1091.8450 1115.0230 1138.6905 1157.7246 1158.4847 1186.2036 1191.2078 1199.4201 1228.7972 1233.3608 1258.1058 1267.3644 1283.8678 1291.7313 1297.5285 1310.2039 1337.4787 1345.1257 1351.0344 1373.7987 1385.3213 1392.3459 1395.9685 1397.6833 1420.2496 1432.4920 1463.6106 1465.9231 1468.5657 1473.7590 1477.2622 1487.1486 1489.1539 1502.7654 1505.5028 1526.0775 1543.3547 1561.1574 1586.4417 1587.5532 1606.6890 1624.6405 1653.1615 2179.5003 2991.6217 2993.1159 2995.5947 3002.1703 3051.4535 3058.8677 3087.8516 3090.3235 3097.8667 3102.0433 3135.3170 3141.0728 3153.8594 3160.2823 3171.3355 3182.5448 3192.2480 3196.7603
redmass: 3.9736 4.1664 4.0282 8.3213 4.9640 4.9418 3.6157 6.1388 4.3392 4.7121 5.9279 2.1589 2.4437 1.9098 6.2364 1.3040 4.7416 6.2204 2.5338 5.7249 5.7811 5.6636 5.9885 6.6652 4.7037 4.9440 4.6293 4.8944 3.0448 6.8767 4.1497 3.6276 5.4798 3.4538 3.6567 8.1297 7.1012 4.0083 7.2127 8.6027 4.4009 7.2365 6.6966 7.1497 5.9638 8.8669 3.3632 1.7811 5.4505 1.3335 6.3969 2.5705 1.2138 1.5270 5.4968 3.6768 1.6362 4.4638 1.4449 5.1850 2.2005 1.3836 2.7546 1.3721 1.4101 1.3026 2.6218 3.0325 4.2649 4.2180 2.1872 1.9397 2.8571 1.6745 2.7074 2.0188 1.8540 1.2351 1.8455 2.0726 2.4158 3.1136 4.8657 3.2859 1.5212 1.2527 1.8150 1.3922 4.8747 1.2528 1.4170 4.5214 2.5091 2.3275 1.3857 3.8113 1.2720 3.7945 3.1497 2.8070 1.1073 2.9970 1.0491 1.1550 1.0620 1.1215 2.0409 1.8128 5.1502 6.5935 8.1136 7.3847 9.5360 8.4341 8.4418 7.9784 12.6227 1.0358 1.0359 1.0635 1.0624 1.1015 1.0993 1.0995 1.0989 1.1013 1.1013 1.0864 1.0900 1.0919 1.0931 1.0977 1.0932 1.0913 1.0962
irintensity: 0.1350 0.9155 0.1577 0.4576 0.6990 1.0503 0.3621 1.0501 3.2363 1.8375 0.0190 0.3982 0.6749 0.4181 4.1746 0.2596 6.8981 1.2908 0.4537 1.5209 0.4014 0.8117 4.4038 3.0472 2.3311 4.4876 0.3873 3.2004 17.4697 11.7951 3.3716 2.4966 1.4302 10.2208 5.2778 0.6747 2.4350 0.1968 10.8208 0.9634 3.5547 5.8140 7.1066 4.3772 4.0763 0.7905 0.9400 42.5632 1.4981 21.8504 10.8850 52.8907 15.0494 29.5445 35.2996 15.4140 41.6771 10.2793 0.3189 0.3549 1.5408 11.5969 1.6715 5.5506 9.0585 0.4141 4.7070 48.9890 20.6768 32.4345 0.3613 61.6249 23.7181 23.9703 132.9173 29.5264 0.5098 9.3915 5.3440 13.1882 79.6299 24.8304 4.1784 271.5259 34.3826 30.0979 115.7176 24.1725 221.2143 39.9501 246.1896 2.8216 4.9986 14.9917 10.1718 91.5014 25.3505 125.8325 44.6490 99.4751 8.3110 5.8711 14.3603 8.2840 9.3972 8.5899 45.9686 72.5720 28.5800 158.1592 214.8860 470.0685 842.4065 120.2897 65.5217 440.2246 54.3118 12.4165 42.5997 57.7967 78.2113 2.2145 19.7685 50.5200 54.9799 7.9233 72.8260 5.5930 4.3483 23.6919 2.2510 30.3227 18.4122 4.2462 6.6952
temp: 298.150 k
press: 1.00000 atm
elementType: 8 8 7 7 7 7 6 6 6 6 6 6 6 6 6 6 6 6 6 6 6 6 6 6 6 6 6 6 6 1 1 1 1 1 1 1 1 1 1 1 1 1 1 1 1 1 1
symmnumber: 1
zpe: 943371.7 jmol-1
zpe.correction: 0.359311 hartree
zpe.thermalcorrener: 0.383421 hartree
zpe.thermalcorrenthalpy: 0.384365 hartree
zpe.thermalcorrgfe: 0.305228 hartree
zpe.sumelectzpe: -1254.717956 hartree
zpe.sumelectthermal: -1254.693846 hartree
zpe.sumelectthermalent: -1254.692902 hartree
zpe.sumelectthermalfe: -1254.772039 hartree
dipole: 11.0336 -6.9714 -0.1027
dipole: 13.0519
quadrupole: -108.3349 -190.7572 -172.1555
quadrupole: 6.1722 -1.7482 0.4115
quadrupole: 48.7477 -33.6747 -15.0729 6.1722 -1.7482 0.4115
hfenergy: -1255.0772671 hartree
pointgroup: C01 [X(C23H18N4O2)]
dipole: -4.3267859 2.7645435 -0.0664506 debye
polarizability: 730.2115692|-17.9337815|326.7023609|9.3908032|-4.8379977|126.4675378 unknown
InChI: InChI=1S/C23H18N4O2/c1-3-26(4-2)15-10-9-14-11-16-21(29-20(14)12-15)17(13-24)23(28)27-19-8-6-5-7-18(19)25-22(16)27/h5-12H,3-4H2,1-2H3
charge 0 multiplicity 1
47 atoms
O  -1.036104 -1.08109 -0.114147
O  3.504446 -2.663306 0.102021
N  3.079634 -0.358159 0.032362
N  -5.682758 0.23798 -0.34594
N  2.884487 1.940096 -0.026556
N  0.246034 -4.357779 0.009596
C  0.785763 0.563203 -0.079494
C  2.215945 0.773673 -0.027804
C  0.333693 -0.809297 -0.066776
C  -1.541487 1.330118 -0.183458
C  4.39954 0.147804 0.075214
C  -1.977404 -0.034376 -0.172167
C  -0.141793 1.607198 -0.136506
C  -4.339632 0.584214 -0.26998
C  4.24917 1.577498 0.037158
C  2.65855 -1.727585 0.045996
C  1.196754 -1.911286 -0.008477
C  -3.317193 -0.417579 -0.208032
C  -2.571977 2.318049 -0.234272
C  -3.920701 1.968854 -0.270618
C  -6.74595 1.272397 -0.320578
C  -6.104743 -1.184562 -0.351829
C  5.658049 -0.480926 0.141593
C  5.390852 2.409967 0.065559
C  6.784703 0.370161 0.169212
C  -7.035178 1.85454 1.083243
C  -6.168594 -1.836159 1.049691
C  6.655063 1.789708 0.131743
C  0.685493 -3.244849 0.001373
H  0.228839 2.637217 -0.143578
H  -3.540843 -1.485074 -0.181295
H  -2.286185 3.375818 -0.242108
H  -4.666004 2.766152 -0.304892
H  -6.483188 2.084778 -1.024225
H  -7.663965 0.806098 -0.719321
H  -7.101437 -1.230546 -0.825876
H  -5.424718 -1.758329 -1.008184
H  5.744824 -1.568607 0.169746
H  5.28103 3.497893 0.036798
H  -7.386654 1.069313 1.774489
H  -6.134421 2.315807 1.523652
H  -7.82053 2.629578 1.01595
H  -5.19497 -1.780168 1.565963
H  -6.922033 -1.340878 1.686512
H  -6.445514 -2.902056 0.957464
H  7.78511 -0.073139 0.220896
H  7.558998 2.408134 0.155283
