program: Gaussian 09
title: 000104163
version: EM64L-G09RevD.01
frameworkgroup: C1[X(C11H26N4O)]
method: RPBEPBE
basis: SDD
operation: Freq
keyword: #p
keyword: freq=noraman
keyword: PBEPBE/SDD
title: #p freq=noraman PBEPBE/SDD
converged: YES YES NO NO
title: Mulliken charges:
elementType: O N N N N C C C C C C C C C C C H H H H H H H H H H H H H H H H H H H H H H H H H H
charge: -0.313987 -0.079075 -0.079125 -0.407766 -0.409701 -0.365839 -0.375872 -0.333178 -0.326058 -0.388469 -0.381866 0.309915 -0.625962 -0.613884 -0.625070 -0.614106 0.214520 0.225014 0.236997 0.204257 0.204585 0.159668 0.197363 0.164870 0.262778 0.202506 0.198891 0.263013 0.277802 0.277404 0.239136 0.219520 0.183587 0.223962 0.182529 0.223444 0.235990 0.220255 0.183144 0.221176 0.184497 0.223134
chargesum: 0.00000
title: Mulliken charges with hydrogens summed into heavy atoms:
elementType: O N N N N C C C C C C C C C C C
charge: -0.313987 -0.079075 -0.079125 -0.129964 -0.132297 0.073695 0.065382 0.031074 0.036175 0.076815 0.080038 0.309915 0.016281 0.016051 0.014319 0.014702
polarizability: 1.80768335e+02 -1.26718613e+00 1.51019100e+02 3.73680257e+00 -6.06276248e+00 1.30915823e+02
1716.lowfreq: -0.0005 0.0004 0.0009 7.0535 8.8186 13.8307 22.9333 25.0999 31.4134
frequency: 14.0234 24.9086 31.3520 35.6759 54.3185 55.3932 85.9362 113.1698 125.1511 140.7115 149.1249 180.0868 214.6867 230.4802 239.4392 244.6829 251.2412 260.8001 268.1218 289.9872 329.7124 331.3339 362.1806 402.8346 404.0455 410.8133 437.4445 487.8926 503.9680 512.1735 529.3496 647.1078 709.9680 758.9360 772.1835 809.2652 817.0018 851.9784 901.5658 912.1654 933.0462 992.0915 1033.2964 1034.3569 1037.4431 1042.4202 1072.6853 1079.9625 1084.7311 1089.6377 1091.3227 1101.2959 1101.4210 1135.5963 1137.1172 1160.9464 1172.1367 1179.6807 1210.9905 1228.6175 1236.7955 1257.1290 1262.2281 1268.8106 1281.8255 1297.3743 1303.1044 1323.5785 1330.1129 1359.5055 1364.5000 1378.2437 1379.5882 1419.4048 1420.4205 1441.1009 1442.9067 1448.9349 1454.9376 1455.6997 1456.6522 1462.5549 1463.1846 1469.1897 1469.9684 1471.2712 1476.0030 1477.1455 1479.8258 1481.4536 1486.1831 1487.2787 1506.9259 1634.0710 2790.6874 2796.3651 2837.4662 2838.2724 2854.1854 2855.0745 2976.0270 2980.2718 2989.0499 2989.1304 2996.5973 2998.6640 3015.6559 3017.0646 3031.2406 3033.0131 3063.0377 3066.2903 3074.8839 3075.7635 3076.2097 3076.7721 3089.9131 3092.6016 3552.6190 3560.6967
redmass: 4.1826 3.4070 2.6094 2.6539 3.5063 6.5677 3.3439 2.8405 2.0259 2.2857 3.8536 2.6328 2.3823 1.3182 1.1550 1.1401 1.2009 1.7594 2.0779 1.3699 2.2692 2.2695 2.4133 2.6031 2.3860 2.3020 2.5975 2.6816 1.4029 2.7429 2.2063 3.3714 8.3990 1.5515 1.4360 2.7518 2.4591 2.1631 2.6549 1.9696 2.7947 2.4068 1.5515 1.5352 2.1382 2.1120 2.9812 1.8252 1.8812 1.5957 1.6051 1.9824 1.9786 1.4954 1.4593 2.1445 1.6297 2.1072 1.4526 1.6814 1.7246 1.7410 2.4885 1.9350 1.4256 1.1792 1.1923 1.3502 1.3156 1.2810 1.3185 1.4078 1.3932 1.1454 1.1435 1.1573 1.1606 1.2353 1.0819 1.0793 1.1008 1.0576 1.0537 1.0988 1.2410 1.0776 1.0759 1.0621 1.0662 1.0724 1.0604 1.0625 2.1739 5.0310 1.0700 1.0705 1.0578 1.0580 1.0577 1.0577 1.0678 1.0672 1.0846 1.0787 1.0608 1.0674 1.0715 1.0711 1.0718 1.0720 1.1012 1.0995 1.1008 1.0974 1.0979 1.0998 1.0998 1.0997 1.0775 1.0767
irintensity: 0.4002 0.8444 0.7079 0.1531 0.9617 18.1966 1.7181 0.2669 1.3559 0.5538 0.3544 5.0759 5.7020 0.2291 0.7603 1.2077 1.8185 0.2087 2.1136 24.2091 9.6563 9.2117 15.7018 1.7029 0.7648 0.5545 2.0925 0.2732 195.0782 7.1233 98.7775 6.3055 6.3614 15.5261 8.3781 10.0194 21.0235 6.2548 0.5250 1.5523 2.2921 6.8298 17.3266 13.4535 30.0631 42.8046 6.1284 3.1379 14.0053 11.2145 5.5451 14.5030 8.0621 11.4233 6.0330 4.8640 7.8858 10.4195 42.6143 115.3461 40.9379 92.7825 10.0480 33.6271 43.2224 5.0315 8.8073 42.4692 19.5688 6.8219 1.6540 8.1917 1.5642 3.4112 2.6287 0.6597 0.1211 81.8438 9.9464 15.2058 3.8141 17.6730 23.5910 1.0308 4.5069 5.4329 7.3729 10.5028 14.1697 18.6625 26.9275 32.3046 548.6624 174.2810 117.1895 87.8261 67.4845 82.5891 282.2216 151.5745 55.8821 60.3780 31.2270 1.0948 24.6071 58.0093 45.7416 48.4161 42.2700 47.3525 51.8207 41.4278 41.5823 4.3091 6.7655 41.7541 37.8488 38.3877 8.9629 6.4159
temp: 298.150 k
press: 1.00000 atm
elementType: 8 7 7 7 7 6 6 6 6 6 6 6 6 6 6 6 1 1 1 1 1 1 1 1 1 1 1 1 1 1 1 1 1 1 1 1 1 1 1 1 1 1
symmnumber: 1
zpe: 977920.1 jmol-1
zpe.correction: 0.372470 hartree
zpe.thermalcorrener: 0.393149 hartree
zpe.thermalcorrenthalpy: 0.394093 hartree
zpe.thermalcorrgfe: 0.319961 hartree
zpe.sumelectzpe: -727.632806 hartree
zpe.sumelectthermal: -727.612127 hartree
zpe.sumelectthermalent: -727.611183 hartree
zpe.sumelectthermalfe: -727.685315 hartree
dipole: 1.0174 2.8667 -4.1142
dipole: 5.1165
quadrupole: -93.1137 -108.7999 -99.6171
quadrupole: -1.2849 1.7680 4.4763
quadrupole: 7.3966 -8.2897 0.8931 -1.2849 1.7680 4.4763
hfenergy: -728.0052764 hartree
pointgroup: C01 [X(C11H26N4O1)]
dipole: 0.3901104 -1.1233263 1.624235 debye
polarizability: 180.8121412|2.4915751|151.2171314|-2.0047976|-5.9903786|130.6739852 unknown
InChI: InChI=1S/C11H26N4O/c1-14(2)9-5-7-12-11(16)13-8-6-10-15(3)4/h12-13H,5-10H2,1-4H3
charge 0 multiplicity 1
42 atoms
O  -0.021033 2.658862 -0.879968
N  -4.396701 -1.605828 -0.318788
N  4.139663 -1.54895 -0.030827
N  -1.26473 1.501371 0.734428
N  1.086332 1.568616 0.873351
C  -3.207514 0.606155 -0.621335
C  3.177155 0.776132 -0.318342
C  -3.618573 -0.52876 0.338551
C  3.527637 -0.378358 0.641515
C  -2.560556 1.807439 0.108353
C  2.42536 1.931846 0.385972
C  -0.064359 1.950099 0.174839
C  -3.627092 -2.348709 -1.338217
C  -5.009671 -2.517554 0.668584
C  5.458706 -1.259033 -0.62923
C  4.197587 -2.723894 0.862993
H  -4.115403 0.956425 -1.14975
H  -2.496338 0.24488 -1.386537
H  2.558695 0.385583 -1.14683
H  4.098209 1.200477 -0.763549
H  -4.260905 -0.099248 1.134252
H  -2.702242 -0.942185 0.845903
H  2.593881 -0.735848 1.12083
H  4.187395 0.016326 1.463926
H  -2.363558 2.616618 -0.61534
H  -3.25512 2.199357 0.879321
H  3.028659 2.314193 1.234313
H  2.276943 2.760394 -0.327351
H  -1.251606 0.889345 1.550633
H  1.006307 1.021749 1.730647
H  -3.290329 -1.67006 -2.138985
H  -4.276232 -3.114964 -1.798267
H  -2.725225 -2.865473 -0.918084
H  -5.64489 -1.941069 1.365042
H  -4.259346 -3.088288 1.275745
H  -5.652089 -3.250819 0.148759
H  5.37024 -0.473497 -1.397906
H  5.843016 -2.168831 -1.123929
H  6.21989 -0.926863 0.12427
H  3.181946 -2.968879 1.223007
H  4.855168 -2.571564 1.75816
H  4.581319 -3.597192 0.30554
