program: Gaussian 09
title: 000104150
version: EM64L-G09RevD.01
frameworkgroup: C1[X(C11H21NO3)]
method: RPBEPBE
basis: SDD
operation: Freq
keyword: #p
keyword: freq=noraman
keyword: PBEPBE/SDD
title: #p freq=noraman PBEPBE/SDD
converged: YES YES NO NO
title: Mulliken charges:
elementType: O O O N C C C C C C C C C C C H H H H H H H H H H H H H H H H H H H H H
charge: -0.260248 -0.293754 -0.254046 -0.103322 -0.401659 -0.332337 -0.384443 -0.333276 -0.505900 0.225197 -0.691366 0.257831 -0.795691 -0.226080 -0.672086 0.216709 0.225636 0.202639 0.199316 0.236597 0.263757 0.196230 0.193125 0.295807 0.235550 0.212583 0.218805 0.215171 0.266805 0.233498 0.231271 0.224841 0.230150 0.233226 0.228950 0.210516
chargesum: 0.00000
title: Mulliken charges with hydrogens summed into heavy atoms:
elementType: O O O N C C C C C C C C C C C
charge: -0.260248 -0.293754 -0.254046 -0.103322 0.040687 0.069617 0.115910 0.056079 0.025457 0.225197 -0.044807 0.257831 -0.064116 0.228911 0.000605
polarizability: 1.68948243e+02 -3.34956889e+00 1.37923548e+02 2.99942918e+00 1.31931262e+00 1.06635927e+02
1716.lowfreq: -11.4767 -0.0009 -0.0007 -0.0005 2.4178 3.4208 10.3398 21.7403 43.7477
frequency: 9.3936 21.4625 43.7179 44.1833 53.5742 65.8535 72.1670 85.6684 120.0422 123.0473 154.9181 157.4997 182.7917 213.0996 237.8317 248.1431 251.5736 291.6848 340.4184 367.7767 381.9856 415.2700 453.5981 480.2653 561.9657 577.4014 612.3853 686.6748 732.9268 753.0594 773.1385 787.5625 798.2531 815.2782 900.2898 917.2410 925.7530 962.1159 997.5688 1018.7903 1022.7195 1032.3030 1047.7908 1063.5238 1067.9035 1111.1966 1113.0340 1129.3095 1134.7541 1149.4576 1179.1001 1220.0905 1237.5533 1247.5891 1264.6664 1278.9912 1289.0230 1293.8666 1315.0222 1339.3178 1355.1424 1358.8868 1375.0639 1376.1900 1393.5522 1400.3391 1416.2994 1441.4830 1447.7645 1458.5832 1462.8944 1466.9594 1472.1781 1474.1830 1476.2149 1479.0847 1483.2029 1486.8717 1489.9170 1590.6476 1629.7694 2963.4195 2975.1138 2977.0028 2986.6796 2988.1504 2992.6063 2996.1259 3005.4510 3009.8650 3028.3199 3033.9020 3062.1936 3068.4067 3073.2894 3075.0417 3076.4544 3077.6594 3092.6298 3099.7304 3108.2227 3128.4073
redmass: 4.2357 4.3569 2.5985 3.2920 2.5873 3.5210 1.8856 4.2631 2.5072 3.1477 1.5195 1.4442 2.5216 3.9605 1.1456 2.4157 1.5582 3.1082 4.0861 3.5575 2.3076 3.2040 3.4631 3.3488 2.9694 3.1553 4.6627 4.5901 1.0773 3.7737 1.4316 1.2372 1.1008 3.2840 1.7514 2.8964 1.5620 2.2414 2.5139 2.2927 2.4281 1.7263 2.5668 2.6369 2.5590 2.3145 2.2593 1.7724 1.4751 2.6907 1.9963 1.5163 1.8502 1.1404 1.2846 1.3016 1.1113 1.5560 1.3149 1.4409 1.3654 1.4003 1.4251 1.2145 1.2135 1.2675 2.3857 1.1264 1.0834 1.0784 1.0402 1.0879 1.0877 1.0607 1.0621 1.0434 1.1066 1.0688 1.1062 5.6909 9.5194 1.0590 1.0497 1.0470 1.0604 1.0418 1.0662 1.0359 1.0995 1.0582 1.0595 1.0999 1.1009 1.1066 1.1007 1.0978 1.0995 1.0956 1.0985 1.1034 1.1025 1.0982
irintensity: 1.3949 0.7854 1.6095 0.1446 0.6845 1.3339 0.5236 5.5846 0.2452 0.1248 3.6708 3.0335 0.4734 4.9359 0.1111 3.3137 2.3233 13.0317 5.7825 4.3917 4.5600 0.3037 13.6701 13.7524 3.1185 7.1475 4.4164 2.6188 9.9922 1.0917 11.8032 0.9734 3.3656 5.4818 5.7485 34.9022 5.6608 7.3834 4.1556 36.3758 7.6758 8.0119 88.0035 1.5013 0.1724 14.3815 6.1770 34.3394 12.1406 323.9664 23.5518 31.1372 8.0510 0.0472 1.0970 28.3816 9.2589 69.8978 61.8860 3.2794 1.3080 22.1877 43.8625 20.4678 10.1063 19.1660 114.9320 19.0904 28.7673 36.2733 11.7528 4.3156 2.2945 4.5491 18.0883 14.6242 9.1940 13.8024 16.9701 252.0638 176.5333 21.9185 13.1999 25.8492 56.1233 24.8499 8.4557 22.4518 3.6201 19.3927 13.2739 15.4803 26.7057 8.7203 78.9848 26.3155 52.9430 3.5602 30.5887 10.0092 44.1306 10.5473
temp: 298.150 k
press: 1.00000 atm
elementType: 8 8 8 7 6 6 6 6 6 6 6 6 6 6 6 1 1 1 1 1 1 1 1 1 1 1 1 1 1 1 1 1 1 1 1 1
symmnumber: 1
zpe: 810634.4 jmol-1
zpe.correction: 0.308754 hartree
zpe.thermalcorrener: 0.327743 hartree
zpe.thermalcorrenthalpy: 0.328687 hartree
zpe.thermalcorrgfe: 0.257241 hartree
zpe.sumelectzpe: -710.991198 hartree
zpe.sumelectthermal: -710.972210 hartree
zpe.sumelectthermalent: -710.971266 hartree
zpe.sumelectthermalfe: -711.042712 hartree
dipole: 1.4767 -1.9460 2.8353
dipole: 3.7425
quadrupole: -69.9863 -104.1133 -93.4949
quadrupole: 2.8215 0.9473 2.1016
quadrupole: 19.2118 -14.9151 -4.2967 2.8215 0.9473 2.1016
hfenergy: -711.2999528 hartree
pointgroup: C01 [X(C11H21N1O3)]
dipole: 0.5664449 -0.9412921 0.9803725 debye
polarizability: 168.7288211|-4.743034|137.1505648|1.5932235|5.8278908|107.6283329 unknown
InChI: InChI=1S/C11H21NO3/c1-4-6-8-12(10(3)13)9-7-11(14)15-5-2/h4-9H2,1-3H3
charge 0 multiplicity 1
36 atoms
O  -3.624906 -0.149014 0.442555
O  0.496824 2.747577 -0.3316
O  -2.358664 -1.563812 -0.907735
N  1.207128 0.6063 0.207033
C  2.173992 -0.349171 0.789543
C  3.167115 -0.935707 -0.243302
C  -0.00299 0.052174 -0.440077
C  4.121638 -1.977429 0.384327
C  -1.243529 0.157333 0.476698
C  1.376068 1.987921 0.19025
C  5.126211 -2.552714 -0.637148
C  -2.422552 -0.615863 -0.087554
C  2.642213 2.56013 0.829239
C  -4.865478 -0.854008 -0.011977
C  -6.038598 -0.163459 0.675484
H  1.602716 -1.1770 1.255431
H  2.733009 0.143172 1.604691
H  2.599433 -1.404169 -1.071899
H  3.756074 -0.111316 -0.69279
H  0.181546 -1.003017 -0.703887
H  -0.195654 0.612082 -1.371054
H  3.526054 -2.803948 0.823092
H  4.674847 -1.510764 1.225302
H  -1.522213 1.213643 0.624279
H  -1.012713 -0.26026 1.477498
H  5.753274 -1.751391 -1.070899
H  5.79957 -3.292679 -0.167594
H  4.600366 -3.054757 -1.470561
H  2.676871 3.632578 0.587395
H  2.6207 2.452619 1.930022
H  3.562571 2.076757 0.456138
H  -4.778927 -1.921237 0.262312
H  -4.917307 -0.785907 -1.113571
H  -6.085819 0.902763 0.395943
H  -5.948411 -0.231177 1.77313
H  -6.986361 -0.64545 0.373384
