program: Gaussian 09
title: 000104185
version: EM64L-G09RevD.01
frameworkgroup: C1[X(C23H19N5O)]
method: RPBEPBE
basis: SDD
operation: Freq
keyword: #p
keyword: freq=noraman
keyword: PBEPBE/SDD
title: #p freq=noraman PBEPBE/SDD
converged: YES YES NO NO
title: Mulliken charges:
elementType: O N N N N N C C C C C C C C C C C C C C C C C C C C C C C H H H H H H H H H H H H H H H H H H H
charge: -0.263295 -0.301447 -0.169056 -0.045498 -0.322777 -0.031035 0.249460 0.005728 0.190828 0.451493 0.301267 0.153846 -0.450087 0.489208 -0.103140 -0.010207 0.111924 -0.539260 -0.452702 -0.394543 -0.369963 -0.380886 -0.335474 -0.350420 -0.230571 -0.229485 -0.664138 -0.661937 -0.261717 0.296897 0.279707 0.246309 0.239678 0.224957 0.215982 0.218295 0.234513 0.309938 0.249183 0.225109 0.225483 0.224169 0.243178 0.223147 0.247597 0.218348 0.227307 0.264086
chargesum: 0.00000
title: Mulliken charges with hydrogens summed into heavy atoms:
elementType: O N N N N N C C C C C C C C C C C C C C C C C C C C C C C
charge: -0.263295 -0.301447 -0.169056 -0.045498 -0.058690 -0.031035 0.249460 0.005728 0.190828 0.451493 0.301267 0.153846 -0.153190 0.489208 -0.103140 -0.010207 0.111924 -0.259553 -0.206392 -0.154865 0.070976 0.071922 -0.025537 -0.101237 -0.005462 -0.004003 0.026356 0.031316 -0.261717
polarizability: 7.27400071e+02 -2.58218173e+01 3.41386146e+02 -1.22506206e+01 1.60025733e+00 1.28587556e+02
1716.lowfreq: -4.2546 -0.4390 -0.0009 0.0002 0.0004 6.0612 22.8161 27.4792 53.1749
frequency: 22.6433 27.4016 53.1478 60.7805 68.1676 79.6317 102.2257 108.6268 114.6270 120.7207 132.0621 163.8867 189.9803 205.1781 210.7040 215.8847 235.5248 259.9840 271.0584 277.7755 305.2704 314.1510 345.8022 372.0583 379.0823 398.9759 416.4600 426.9103 438.1270 461.0110 462.2384 474.7181 489.8827 508.5178 530.0349 532.5171 579.0476 579.7447 602.9385 603.3886 629.6216 633.1717 663.3543 668.1269 689.9359 695.0615 733.0979 758.0973 762.4481 768.1255 775.5159 777.3843 785.7044 798.2373 807.7771 818.0558 818.0947 852.4773 866.9508 880.1353 897.3937 918.5735 931.0180 941.1930 960.3510 960.6378 992.1962 997.7613 1010.3942 1020.9041 1029.3384 1066.8930 1085.3029 1087.2319 1092.1223 1108.8071 1134.1110 1150.1832 1156.2804 1158.8029 1189.2708 1194.5817 1204.8656 1230.8776 1241.5623 1262.6429 1266.8163 1284.0116 1293.2758 1297.5963 1337.8027 1342.3849 1346.4483 1366.7577 1380.1076 1386.1661 1391.6036 1396.2012 1397.1201 1419.5752 1433.0502 1462.9575 1465.8607 1468.9950 1473.6161 1477.1629 1486.9571 1488.9712 1502.4967 1505.7598 1526.3103 1543.7656 1554.3796 1582.8216 1589.3846 1603.6608 1623.5921 1653.5105 2161.6990 2990.9697 2992.3486 2993.7616 3000.1325 3049.5790 3057.0200 3086.9677 3089.4596 3097.3644 3101.4731 3132.7290 3139.9781 3151.6498 3161.5436 3169.9177 3181.3999 3190.8548 3203.3842 3363.6008
redmass: 3.8982 4.1789 3.9880 7.3345 4.9457 5.0364 3.5351 5.5252 4.3081 4.7361 5.0326 2.1333 2.3586 2.0626 6.0307 1.2533 4.4105 6.0941 2.5511 5.1917 5.8682 4.8206 5.7978 5.8284 4.7199 4.2653 4.6043 5.1323 3.0414 5.9503 3.9712 3.5874 5.5927 3.4348 4.0810 6.8854 7.0640 3.9619 7.7990 6.9693 4.5037 7.2491 6.8851 6.3464 6.0701 8.3414 3.4130 2.5960 5.3431 2.6839 1.3710 2.3467 1.2317 4.3377 1.4960 1.4622 2.2879 1.6443 3.9788 1.4412 5.3027 2.1793 1.3914 2.7788 1.3638 1.4061 1.2935 3.2523 2.6465 3.1513 3.7336 2.1754 1.9873 2.4642 1.6669 2.4883 1.9489 2.1037 1.2466 1.8931 1.8935 2.3548 1.7113 3.2431 4.7562 2.7002 1.6100 1.2596 1.7583 1.3961 1.2528 2.9639 1.7629 2.8032 4.6452 2.1301 1.3987 2.1872 1.6580 3.6592 3.4215 2.7040 1.1203 3.0762 1.0491 1.1543 1.0633 1.1115 1.5231 2.5874 5.2565 5.9140 8.9111 6.9189 8.0861 7.7623 8.2581 8.0707 12.6161 1.0360 1.0360 1.0631 1.0624 1.1014 1.0993 1.0995 1.0988 1.1012 1.1012 1.0863 1.0899 1.0920 1.0930 1.0978 1.0932 1.0911 1.0956 1.0759
irintensity: 0.2152 0.5860 0.4396 0.6542 0.6898 0.8618 0.1476 1.2055 2.5494 1.5346 0.5424 0.4666 0.6761 0.4569 4.2979 0.4041 4.1830 1.0564 0.5616 0.2048 1.1036 3.0457 1.4634 1.1070 2.2006 3.3241 0.2697 6.8596 17.5390 6.0574 1.5648 1.6729 2.7909 10.6231 3.8765 2.2175 1.2212 0.1158 7.2517 2.0088 3.9723 5.8147 2.4035 9.7426 3.9292 0.0203 0.7297 23.2629 1.3793 60.9078 23.5794 14.1295 12.4181 21.2755 26.7836 59.6742 19.9767 42.6423 2.6649 0.5047 0.9052 1.0673 12.0552 2.8323 7.6567 7.1948 1.7422 15.4575 30.5837 44.6266 11.9285 0.3378 67.3707 14.4694 23.4158 44.5246 178.8500 59.2259 9.9392 8.4469 0.0693 61.6487 29.4363 16.0731 13.6468 228.3453 18.4449 23.4383 14.0081 16.0189 45.3173 401.3708 67.8883 100.3930 72.9372 3.3735 9.8882 80.9032 27.9894 124.7936 69.0743 54.5311 4.7592 3.8193 12.9854 3.5539 8.9212 5.3976 24.7093 46.1487 29.2843 231.9063 37.3670 16.4924 835.9096 408.5913 37.3353 446.9203 92.6578 10.2378 44.8252 61.1549 81.6995 2.3852 21.9951 50.7272 56.7888 7.4686 74.6635 5.9970 4.9056 26.5707 3.4396 33.0800 20.0821 5.0404 9.0169 30.9648
temp: 298.150 k
press: 1.00000 atm
elementType: 8 7 7 7 7 7 6 6 6 6 6 6 6 6 6 6 6 6 6 6 6 6 6 6 6 6 6 6 6 1 1 1 1 1 1 1 1 1 1 1 1 1 1 1 1 1 1 1
symmnumber: 1
zpe: 975019.4 jmol-1
zpe.correction: 0.371365 hartree
zpe.thermalcorrener: 0.395568 hartree
zpe.thermalcorrenthalpy: 0.396512 hartree
zpe.thermalcorrgfe: 0.317252 hartree
zpe.sumelectzpe: -1234.825084 hartree
zpe.sumelectthermal: -1234.800881 hartree
zpe.sumelectthermalent: -1234.799937 hartree
zpe.sumelectthermalfe: -1234.879198 hartree
dipole: 10.4217 -4.4620 -0.0903
dipole: 11.3371
quadrupole: -116.8684 -181.3934 -174.2385
quadrupole: -1.0045 -1.5703 0.4420
quadrupole: 40.6317 -23.8933 -16.7384 -1.0045 -1.5703 0.4420
hfenergy: -1235.1964495 hartree
pointgroup: C01 [X(C23H19N5O1)]
dipole: 4.086582 1.786904 0.0411169 debye
polarizability: 727.0959531|28.6844571|341.7047967|9.2599382|5.0064159|128.5730233 unknown
InChI: InChI=1S/C23H19N5O/c1-3-27(4-2)15-10-9-14-11-16-21(29-20(14)12-15)17(13-24)22(25)28-19-8-6-5-7-18(19)26-23(16)28/h5-12,25H,3-4H2,1-2H3
charge 0 multiplicity 1
48 atoms
O  1.044521 -1.089063 0.115267
N  -3.087388 -0.36989 -0.030367
N  5.68853 0.250144 0.346115
N  -2.875839 1.926792 0.025199
N  -3.587142 -2.664096 -0.09852
N  -0.313494 -4.385609 -0.00588
C  -0.784157 0.55205 0.078523
C  -2.2172 0.75448 0.027212
C  -0.32669 -0.818193 0.068077
C  1.54053 1.325613 0.180637
C  -4.403152 0.146241 -0.072156
C  1.981983 -0.035793 0.171527
C  0.136928 1.59873 0.133354
C  4.342624 0.592124 0.268669
C  -2.66417 -1.730525 -0.042102
C  -4.241435 1.575415 -0.036266
C  -1.192572 -1.912895 0.012112
C  3.32376 -0.413423 0.207987
C  2.566599 2.316448 0.229637
C  3.918283 1.973457 0.266739
C  6.746553 1.288693 0.319268
C  6.115318 -1.169936 0.352597
C  -5.670856 -0.466673 -0.135852
C  -5.374288 2.420312 -0.064166
C  -6.788008 0.396108 -0.162971
C  -6.645074 1.814715 -0.127712
C  7.03467 1.870243 -1.085276
C  6.180605 -1.823339 -1.048324
C  -0.695683 -3.249663 0.003425
H  -0.237708 2.627121 0.13882
H  3.552112 -1.480049 0.183161
H  2.276599 3.373152 0.235482
H  4.659654 2.774549 0.299462
H  6.479425 2.101673 1.020768
H  7.66678 0.827903 0.719734
H  7.112718 -1.212627 0.825773
H  5.437944 -1.746179 1.009785
H  -5.757888 -1.553547 -0.161818
H  -5.251059 3.506934 -0.036896
H  -7.792978 -0.037541 -0.212547
H  -7.542502 2.442791 -0.150799
H  7.391239 1.08559 -1.774655
H  6.131481 2.325204 -1.527224
H  7.815436 2.650075 -1.018798
H  5.206413 -1.769814 -1.563836
H  6.932001 -1.325949 -1.685968
H  6.460809 -2.888478 -0.955855
H  -3.18043 -3.619476 -0.10254
