program: Gaussian 09
title: 000104145
version: EM64L-G09RevD.01
frameworkgroup: C1[X(C12H25N5O2)]
method: RPBEPBE
basis: SDD
operation: Freq
keyword: #p
keyword: freq=noraman
keyword: PBEPBE/SDD
title: #p freq=noraman PBEPBE/SDD
converged: YES YES NO NO
title: Mulliken charges:
elementType: O O N N N N N C C C C C C C C C C C C H H H H H H H H H H H H H H H H H H H H H H H H H
charge: -0.208673 -0.214393 -0.171027 -0.285561 -0.287990 -0.292801 -0.580143 -0.366708 -0.361258 -0.511475 -0.508914 0.178773 0.174434 -0.373093 -0.370144 -0.372665 -0.373584 -0.332773 -0.391611 0.233422 0.260086 0.209172 0.234853 0.262672 0.264619 0.262381 0.264484 0.235330 0.167819 0.165849 0.230578 0.245938 0.196577 0.203653 0.238255 0.192256 0.206682 0.237387 0.207428 0.193379 0.206304 0.193303 0.275977 0.261200
chargesum: 0.00000
title: Mulliken charges with hydrogens summed into heavy atoms:
elementType: O O N N N N N C C C C C C C C C C C C
charge: -0.208673 -0.214393 -0.171027 -0.039623 -0.049735 -0.055414 -0.042965 0.126800 0.082766 0.015816 0.017951 0.178773 0.174434 0.030056 0.026283 0.027565 0.025355 0.068034 0.007996
polarizability: 2.30736034e+02 3.00278239e+00 1.56924817e+02 -7.46450595e+00 -2.45525291e+00 1.34100812e+02
1716.lowfreq: -40.8981 -7.9890 -4.8566 -0.0013 -0.0008 0.0009 4.7946 10.6867 18.7763
frequency: -35.4295 -3.0018 18.7189 22.5548 35.7804 53.8377 55.9931 76.5756 89.0313 93.0986 101.9708 111.3440 122.1990 133.2543 140.7146 156.5612 168.2010 196.8770 219.8359 267.0216 277.9001 292.3546 353.0608 375.8217 431.0404 448.3332 493.5364 529.9488 541.0003 544.5568 578.8441 597.4951 609.4010 654.7587 679.0345 684.5772 690.1635 729.3701 783.6181 800.1171 811.3050 824.8987 825.2512 948.0058 953.5004 985.7899 1008.5558 1011.5616 1020.9301 1023.4951 1043.1788 1047.2955 1057.8203 1067.0897 1076.8651 1088.7561 1102.8793 1113.9589 1126.5084 1142.3021 1143.2549 1145.4877 1154.0803 1162.4806 1198.0707 1208.6587 1222.6185 1233.4953 1243.7884 1252.5260 1260.3986 1269.3628 1276.7228 1279.7089 1287.2044 1291.3042 1303.0381 1318.3067 1329.7694 1342.5066 1353.2887 1368.8113 1381.6657 1394.2317 1404.7395 1440.0035 1444.1446 1445.1295 1456.2164 1457.6494 1459.0967 1476.7792 1479.3922 1485.0144 1489.7830 1493.7104 1496.4080 1498.0530 1630.0243 1641.8709 1695.4280 2827.5300 2842.4339 2882.8125 2884.3028 2893.9265 2899.4292 2912.9123 2974.2752 2981.3420 2999.9583 3012.8189 3021.3879 3026.3794 3026.5567 3035.0794 3036.0161 3044.7014 3078.5037 3096.2973 3101.4460 3415.2391 3420.8963 3429.8894 3464.5130 3592.0069
redmass: 1.8392 5.3244 4.6439 5.2885 2.8173 3.1520 2.9218 2.8781 1.8581 3.0407 2.4379 6.5116 2.2431 3.1881 2.6787 2.3109 3.6456 2.2534 1.3938 3.3142 3.3572 4.7653 3.5762 6.5573 3.2946 4.8635 2.9535 3.9744 4.0313 3.4819 2.9946 1.3164 5.9905 5.7766 1.2612 1.3304 1.3043 4.1215 1.2197 1.1013 1.1220 1.3870 1.2451 2.5220 1.7985 3.1022 2.6346 2.1960 3.1291 3.1267 1.8435 2.6914 2.2342 3.5399 3.2675 2.1947 1.6093 2.3647 2.1498 1.2515 2.7288 1.7709 3.3964 4.2829 1.9408 1.1134 1.6912 1.4545 1.2869 1.6719 1.2887 1.1365 1.1943 1.0993 1.1687 1.5043 1.2642 1.3359 1.3343 1.5697 2.4780 1.5296 1.4502 1.4732 1.4934 1.0752 1.1015 1.2376 1.0976 1.1957 1.2291 1.0711 1.0769 1.0878 1.0875 1.0852 1.0847 1.0837 12.1315 1.0933 11.3931 1.0718 1.0714 1.0706 1.0688 1.0678 1.0670 1.0666 1.0875 1.0890 1.0954 1.0964 1.0651 1.0594 1.0838 1.0838 1.0635 1.0906 1.1032 1.1016 1.1044 1.0735 1.0736 1.0739 1.0450 1.0977
irintensity: 0.9040 0.1239 0.0814 0.4409 0.9435 0.7713 0.5401 2.7325 0.1501 4.4494 1.0496 12.8557 2.7001 0.6429 4.5953 12.9288 3.3839 10.4073 37.6982 9.5859 2.6314 16.1327 2.5649 13.1491 3.2642 7.5398 19.7446 7.0968 0.0772 0.0639 8.2012 257.6509 11.5456 37.8477 26.6732 89.2227 144.8002 4.0798 12.0081 2.6403 1.1554 10.2568 10.9976 8.6361 0.6232 1.4639 28.2485 0.0950 1.1759 1.0262 10.8417 10.8277 1.9276 5.4753 38.6267 5.7608 26.0120 26.0023 83.1804 4.0304 24.7444 48.1190 28.8365 167.1046 28.4703 0.0514 13.8683 7.4798 2.2170 33.4557 20.7956 4.1197 9.2499 4.8089 12.1103 0.5307 5.6052 16.5683 31.6072 32.0422 124.1066 40.0853 25.7200 3.1447 3.9752 0.8883 25.1805 1.8214 16.1460 98.2795 8.3562 0.8151 0.2378 6.8503 7.9923 2.4415 0.8237 6.7125 567.9658 41.1646 11.5833 148.7117 93.7089 98.2836 3.9515 25.2873 140.2825 201.4776 0.6037 6.5030 79.6880 94.0578 12.3690 13.6330 15.5176 18.6705 3.1275 43.9415 0.0126 9.2150 3.4935 2.7434 2.0381 0.6482 0.8514 0.3881
temp: 298.150 k
press: 1.00000 atm
elementType: 8 8 7 7 7 7 7 6 6 6 6 6 6 6 6 6 6 6 6 1 1 1 1 1 1 1 1 1 1 1 1 1 1 1 1 1 1 1 1 1 1 1 1 1
symmnumber: 1
zpe: 994415.7 jmol-1
zpe.correction: 0.378753 hartree
zpe.thermalcorrener: 0.399786 hartree
zpe.thermalcorrenthalpy: 0.400730 hartree
zpe.thermalcorrgfe: 0.325191 hartree
zpe.sumelectzpe: -894.925247 hartree
zpe.sumelectthermal: -894.904215 hartree
zpe.sumelectthermalent: -894.903271 hartree
zpe.sumelectthermalfe: -894.978809 hartree
dipole: -0.5058 -1.3596 0.9454
dipole: 1.7314
quadrupole: -79.1403 -132.5775 -113.3023
quadrupole: -10.5096 -11.5781 -2.0684
quadrupole: 29.1997 -24.2374 -4.9623 -10.5096 -11.5781 -2.0684
hfenergy: -895.3040004 hartree
pointgroup: C01 [X(C12H25N5O2)]
dipole: -0.1994549 0.5806158 -0.2951947 debye
polarizability: 230.7518286|-3.9699333|157.1608683|6.8917095|0.7308219|133.8489652 unknown
InChI: InChI=1S/C12H25N5O2/c13-3-4-14-5-6-15-7-8-16-9-10-17-11(18)1-2-12(17)19/h14-16H,1-10,13H2
charge 0 multiplicity 1
44 atoms
O  -4.766784 -2.420307 0.040172
O  -5.354784 2.225002 0.245103
N  -4.790795 -0.068871 0.276468
N  -1.057335 0.423327 0.562083
N  2.632923 0.259034 -0.227178
N  6.36588 -0.08606 0.296672
N  10.055806 -0.207141 -0.53504
C  -3.469229 0.072635 0.909683
C  -2.33818 0.216442 -0.13595
C  -6.714805 -1.049204 -0.736275
C  -6.90738 0.48516 -0.672904
C  -5.337771 -1.315328 -0.115385
C  -5.634395 1.029994 -0.014307
C  0.156103 0.260912 -0.265319
C  1.4204 0.335812 0.611083
C  3.907555 0.183439 0.518541
C  5.09217 0.001798 -0.449541
C  7.577634 -0.160747 -0.549389
C  8.852382 -0.146976 0.318571
H  -3.508411 0.970126 1.553562
H  -3.27939 -0.818762 1.529806
H  -2.601703 1.035129 -0.849205
H  -2.266797 -0.72073 -0.718348
H  -6.726959 -1.448638 -1.764699
H  -7.476762 -1.607045 -0.165471
H  -7.024621 0.951028 -1.666313
H  -7.779629 0.790216 -0.069872
H  0.122083 -0.730176 -0.753033
H  0.232168 1.02157 -1.085834
H  1.37897 1.263809 1.241579
H  1.417376 -0.520323 1.310534
H  -1.044936 1.312526 1.081562
H  3.849602 -0.694002 1.195337
H  4.10781 1.074594 1.161229
H  2.653045 1.015541 -0.926524
H  5.155888 0.883415 -1.121045
H  4.886627 -0.883503 -1.098483
H  6.341975 -0.862577 0.974279
H  7.613746 -1.058359 -1.211822
H  7.580781 0.727979 -1.214048
H  8.80103 0.739966 0.992147
H  8.853937 -1.045193 0.968306
H  10.915728 -0.468287 -0.045462
H  10.187847 0.617775 -1.128371
