program: Gaussian 09
title: 000104121
version: EM64L-G09RevD.01
frameworkgroup: C1[X(C5H9N3O3)]
method: RPBEPBE
basis: SDD
operation: Freq
keyword: #pfreq=noraman
keyword: PBEPBE/SDD
title: #p freq=noraman PBEPBE/SDD
converged: NO YES NO NO
title: Mulliken charges:
elementType: O O O N N N C C C C C H H H H H H H H H
charge: -0.184623 -0.179029 -0.232663 -0.176577 -0.435632 0.032290 -0.353502 -0.644584 0.377139 0.251129 -0.785872 0.249262 0.258278 0.242712 0.233152 0.229850 0.359649 0.243684 0.270798 0.244539
chargesum: 0.00000
title: Mulliken charges with hydrogens summed into heavy atoms:
elementType: O O O N N N C C C C C
charge: -0.184623 -0.179029 -0.232663 -0.176577 -0.075983 0.032290 0.154038 0.061131 0.377139 0.251129 -0.026851
polarizability: 1.15957823e+02 -6.29065563e+00 1.00704133e+02 1.72937859e+00 2.71552032e+00 5.29947198e+01
1716.lowfreq: -12.6349 -4.8101 -0.0011 -0.0008 -0.0006 6.3606 28.8451 38.7688 59.4477
frequency: 28.7430 38.5297 59.4297 62.1484 121.5666 122.9529 168.9352 208.4612 245.3197 283.1437 333.5212 344.1162 375.4878 475.7717 499.1207 552.6147 571.2852 714.9081 718.1233 768.9054 800.6540 812.6751 894.5624 927.3492 973.1791 1003.1417 1036.1732 1079.5922 1096.5273 1176.6303 1197.8263 1246.5342 1327.0392 1348.4264 1370.8136 1378.7727 1392.8069 1439.7810 1443.5530 1465.3866 1471.3986 1473.1283 1481.1818 1652.5999 1701.0673 2991.9230 2999.2570 3037.0750 3077.1941 3096.4408 3100.1923 3119.9486 3141.3648 3422.2333
redmass: 1.4443 2.2330 4.0964 3.1795 4.9857 5.9060 4.6052 1.1072 10.2303 6.6088 2.4594 4.0092 7.4255 6.3159 5.7554 4.6079 2.9382 4.3876 2.7912 2.5067 2.9767 1.1692 4.3132 2.2039 2.6808 2.3312 1.7102 2.7128 2.3915 2.1369 2.7599 5.1569 1.2644 1.2824 3.5193 1.2358 1.4757 1.2076 1.1614 1.0471 1.3708 1.1353 1.0531 5.5039 11.0547 1.0383 1.0351 1.0599 1.0980 1.1019 1.0990 1.1041 1.0985 1.0771
irintensity: 3.7336 0.2167 3.6562 4.0701 9.7275 5.7400 0.1453 0.4065 8.5607 0.5066 2.0229 3.2653 6.8932 1.2268 1.8404 41.6743 0.7395 6.3863 2.6724 91.3763 43.3355 99.1666 55.6806 120.4390 24.4216 21.4362 11.3580 31.1582 33.0071 16.3862 213.0717 1.6869 20.2572 0.3430 184.6502 63.8435 53.2589 280.8019 106.3414 22.8636 379.7872 173.6160 26.3173 10.5520 282.0755 3.7778 17.1670 10.1494 10.8635 8.5089 23.8310 7.4362 7.3557 77.5132
temp: 298.150 k
press: 1.00000 atm
elementType: 8 8 8 7 7 7 6 6 6 6 6 1 1 1 1 1 1 1 1 1
symmnumber: 1
zpe: 393987.2 jmol-1
zpe.correction: 0.150062 hartree
zpe.thermalcorrener: 0.162502 hartree
zpe.thermalcorrenthalpy: 0.163446 hartree
zpe.thermalcorrgfe: 0.109329 hartree
zpe.sumelectzpe: -584.960646 hartree
zpe.sumelectthermal: -584.948206 hartree
zpe.sumelectthermalent: -584.947262 hartree
zpe.sumelectthermalfe: -585.001379 hartree
dipole: -1.0121 2.6619 0.4442
dipole: 2.8822
quadrupole: -61.4961 -76.1701 -62.2253
quadrupole: 18.4211 1.5986 -0.5071
quadrupole: 5.1344 -9.5396 4.4052 18.4211 1.5986 -0.5071
hfenergy: -585.1107077 hartree
pointgroup: C01 [X(C5H9N3O3)]
dipole: 0.4737483 -1.0133826 0.1856775 debye
dipolederiv: -0.6000917 0.0455447 -0.0041116 -0.1040717 -0.8963933 0.0939428 0.0277496 0.071562 -0.3218395 -0.8285872 0.0846432 0.0208096 0.4300348 -0.6877308 0.0238795 -0.0077191 0.0410656 -0.3023096 -0.7666973 0.8024679 -0.0223694 0.1736935 -0.6083076 0.0185199 0.0021759 0.0031295 -0.1801413 -0.9273802 0.2266864 -0.020462 0.7366215 -1.0189532 0.0201831 -0.0749705 0.0720739 -0.1815658 -2.2340864 -0.2219158 0.1322371 -0.4254091 -0.5474759 0.0538782 0.2009264 0.0451797 -0.3581769 0.2520807 -0.7277244 0.0167751 -0.6930278 1.193142 -0.0715503 0.1004429 -0.1053939 -0.0359756 0.2797306 0.1227123 0.0197404 0.1782835 0.1261582 0.0341162 -0.0028076 -0.0340591 0.2200466 0.0061932 -0.0368147 -0.0034728 -0.0418845 0.0254786 -0.0162944 0.0035209 0.0392854 -0.0333725 2.2343617 -0.2801056 -0.0527231 0.3423106 1.3021635 -0.1636263 -0.1677825 -0.0949669 0.3622735 2.19119 0.0853791 -0.1421937 -0.3479207 0.9962311 -0.0818197 -0.1257716 -0.1065968 0.2283608 -0.2002379 -0.1405184 0.0336905 -0.2550179 -0.3306302 0.067736 0.0560694 0.0634653 0.0314706 0.0038861 -0.0124189 0.0473021 0.0657091 0.0255388 -0.1086411 0.0188931 -0.0360344 0.0389191 0.09188 0.0122037 -0.084182 -0.0275693 0.0284235 0.0697595 -0.0561356 0.0451242 0.0335087 0.0032883 0.0978841 0.077752 0.0655381 0.0478952 -0.0683858 0.0396595 -0.0474684 0.0224789 0.0982357 0.0206775 -0.0381344 0.0644478 -0.0358122 0.1123698 -0.0341103 0.0452665 0.0014627 -0.0779325 -0.1336244 0.0207766 -0.1305876 0.0243886 0.0120744 0.020438 -0.0008385 0.0764367 0.380686 0.0118274 0.0041181 -0.0993993 0.1707604 0.0223456 0.0092631 0.0170369 0.297986 0.0912416 0.0225388 0.069797 0.0056447 0.0251947 -0.0787649 0.0362012 -0.103969 -0.0036925 -0.0703464 0.0050732 0.0133888 0.0584047 0.0901323 0.0011061 0.0074736 0.0044962 0.1333034 0.0725858 0.0154838 -0.0887381 0.0041997 0.069796 0.0591713 -0.0535162 0.0816418 -0.0291733 unknown
polarizability: 116.8312727|-5.0661282|99.8116473|-0.9336633|-3.1944863|53.0137559 unknown
InChI: InChI=1S/C5H9N3O3/c1-3-8(7-11)5(10)6-4(2)9/h6H,3H2,1-2H3
charge 0 multiplicity 1
20 atoms
O  -0.251673 1.815473 -0.350723
O  -3.062759 1.033678 -0.018267
O  2.397539 -1.935385 -0.062872
N  1.178716 -0.040811 -0.2362
N  -1.157479 -0.360347 -0.0078
N  1.226427 -1.43014 -0.056138
C  2.392465 0.792322 -0.411663
C  2.96813 1.274505 0.936908
C  -0.142243 0.581514 -0.206218
C  -2.557936 -0.105667 0.077723
C  -3.361377 -1.382806 0.308558
H  3.127646 0.168537 -0.94879
H  2.101506 1.649741 -1.038666
H  2.234463 1.897915 1.475173
H  3.258923 0.423382 1.575787
H  3.867785 1.887024 0.750442
H  -0.823964 -1.330263 0.084728
H  -3.20115 -2.108332 -0.510118
H  -4.428985 -1.126586 0.355233
H  -3.067633 -1.870055 1.256605
