program: Gaussian 09
title: 000104129
version: EM64L-G09RevD.01
frameworkgroup: C1[X(C9H12N2O2)]
method: RPBEPBE
basis: SDD
operation: Freq
keyword: #p
keyword: freq=noraman
keyword: PBEPBE/SDD
title: #p freq=noraman PBEPBE/SDD
converged: YES YES NO NO
title: Mulliken charges:
elementType: O O N N C C C C C C C C C H H H H H H H H H H H H
charge: -0.458038 -0.287470 -0.343327 -0.538373 0.487301 0.450179 -0.508958 -0.532212 -0.454034 -0.563333 -0.404080 -0.212538 0.230874 0.246231 0.229807 0.265210 0.234319 0.223799 0.217251 0.234287 0.227091 0.330307 0.271749 0.267071 0.386888
chargesum: 0.00000
title: Mulliken charges with hydrogens summed into heavy atoms:
elementType: O O N N C C C C C C C C C
charge: -0.071150 -0.287470 -0.013019 0.000446 0.487301 0.450179 -0.262727 -0.037195 -0.219715 -0.122283 -0.169794 0.014553 0.230874
polarizability: 1.44139882e+02 -6.90879128e+00 1.27458842e+02 -7.10394094e+00 5.92458755e+00 7.82399337e+01
1716.lowfreq: -13.9987 -6.4358 -3.2382 -0.0012 -0.0008 -0.0006 7.5395 17.2412 32.7220
frequency: -12.5396 16.9179 32.6821 65.6286 123.7210 174.1171 196.6825 231.6069 269.0650 298.8309 324.1693 377.0972 434.4081 483.1804 493.4218 511.7819 558.4761 602.9367 609.1203 628.8390 663.0279 698.9070 704.8804 740.4222 810.9949 856.3305 878.3558 912.3079 914.9041 939.8518 983.2671 989.1550 1018.2080 1044.8314 1063.3913 1087.5484 1125.8193 1153.0935 1168.7727 1182.0655 1232.3451 1252.2601 1277.0742 1304.9395 1331.0888 1331.7889 1357.0608 1389.1689 1439.1025 1456.2569 1474.7972 1479.2385 1502.5540 1596.8717 1614.8639 1646.6748 1691.9938 2985.8891 2997.4428 3048.0654 3056.2766 3108.5071 3113.9420 3121.6842 3151.1686 3444.5810 3570.3277 3571.0850 3586.3081
redmass: 2.4708 5.7893 4.9970 6.0621 4.2636 3.3033 4.6557 1.5983 2.9194 2.7874 3.2063 2.1726 2.9120 1.7330 1.6990 4.2974 2.8555 1.3488 5.0907 1.8476 3.0748 11.4752 2.5092 2.4825 1.6956 1.3586 2.8881 1.5253 1.5306 2.7988 1.3534 6.2228 2.6395 2.6249 3.7874 1.7388 1.2808 1.6584 1.9568 1.0841 1.2848 2.6970 1.6656 1.3210 1.2234 1.2580 1.6182 4.1885 2.2968 1.1532 1.5068 1.4773 1.9617 6.0560 6.0856 1.0852 7.6473 1.0629 1.0604 1.0989 1.1042 1.0906 1.0867 1.0916 1.0988 1.0448 1.0775 1.0972 1.0652
irintensity: 1.5334 1.5478 0.8443 3.6756 0.4656 5.9674 7.9082 25.3113 12.6772 10.3476 2.7907 10.4203 3.2771 143.0534 103.5683 51.5405 47.2572 157.2158 11.5795 16.3177 197.2392 47.3974 25.1312 31.6854 37.5554 1.6185 12.2950 5.2523 8.9339 11.8344 0.5879 0.2262 70.7778 129.5420 14.1267 20.3260 18.2305 57.6667 114.0582 0.3492 17.6826 16.9784 18.2275 7.0824 3.2426 0.3052 8.2351 1.8421 19.4445 10.6877 26.0033 4.4608 236.0251 6.4405 11.7485 28.8075 400.0475 36.4035 46.2335 7.0700 20.2453 10.9308 1.2390 22.9844 28.8531 3.1542 36.0394 0.5506 53.9606
temp: 298.150 k
press: 1.00000 atm
elementType: 8 8 7 7 6 6 6 6 6 6 6 6 6 1 1 1 1 1 1 1 1 1 1 1 1
symmnumber: 1
zpe: 529360.6 jmol-1
zpe.correction: 0.201623 hartree
zpe.thermalcorrener: 0.213814 hartree
zpe.thermalcorrenthalpy: 0.214758 hartree
zpe.thermalcorrgfe: 0.161092 hartree
zpe.sumelectzpe: -609.149538 hartree
zpe.sumelectthermal: -609.137347 hartree
zpe.sumelectthermalent: -609.136403 hartree
zpe.sumelectthermalfe: -609.190069 hartree
dipole: 0.8975 -1.3509 -2.5129
dipole: 2.9908
quadrupole: -77.0718 -75.3683 -80.5708
quadrupole: -7.8945 4.0014 0.9234
quadrupole: 0.5985 2.3020 -2.9005 -7.8945 4.0014 0.9234
hfenergy: -609.3511612 hartree
pointgroup: C01 [X(C9H12N2O2)]
dipole: 0.2346939 -0.6701348 -0.9383173 debye
dipolederiv: -0.7719181 0.2385918 -0.3081825 0.3957874 -0.7444625 0.3435806 -0.4988104 0.4362724 -0.6721703 -0.6499413 0.1734672 0.1493249 0.2588041 -0.510813 -0.0663915 0.2790282 -0.0982241 -1.0520387 -1.1973698 0.3494022 0.1484174 0.4507906 -0.7452203 -0.1408384 0.2020887 -0.1598144 -0.3963123 -0.360491 -0.3354266 -0.011486 -0.3895117 -0.9645928 0.1876137 -0.0046437 0.1819196 -0.4079681 0.1916498 0.0104425 -0.0760962 0.008698 -0.0142238 0.0213912 -0.1220616 0.051594 -0.0080097 -0.0174475 0.0390482 -0.0150596 0.0878274 0.1351858 0.0279838 -0.0641222 -0.0749179 -0.1073972 -0.1707609 -0.1539202 0.0027162 -0.1243202 -0.0941778 0.0524641 -0.0011009 0.0407755 -0.1524074 0.5557821 -0.0840848 0.0613571 -0.149989 0.4364052 -0.0493203 0.3960982 -0.1767899 0.120705 -0.169445 0.0604245 0.00961 0.0398954 -0.0058564 0.0357691 -0.0230135 0.0094236 -0.1780857 0.2996166 0.1330426 0.0524263 0.1637905 0.489158 -0.0958286 0.0599134 -0.0446499 0.3925999 0.0403197 0.0075966 -0.026758 -0.0552742 -0.1975371 0.040686 -0.0304442 0.0099735 -0.1627003 0.0387103 -0.0585386 -0.0397791 -0.0608709 0.1012468 0.0348887 -0.0278386 0.0263751 -0.1167181 1.380466 -0.8323699 -0.1332741 -1.1258402 1.1315559 -0.0113123 -0.2968474 0.0252199 1.5568553 0.0647145 0.0741186 0.0236516 0.1032374 -0.033101 -0.0421777 0.039444 -0.0402102 0.1163175 -0.0099277 0.0105772 -0.0130971 -0.0195802 -0.1811373 -0.0082523 -0.081079 -0.0299515 0.0904628 0.0342695 -0.0207431 0.044281 0.017068 0.107876 -0.0572964 -0.0358791 0.0209959 0.0044467 0.0384267 -0.1142822 0.0008733 -0.0871102 -0.0654017 -0.0192564 0.0012967 -0.0180973 0.1528466 0.0428656 0.0516203 0.1137352 -0.0079116 -0.0433649 -0.0657072 0.0449341 -0.0568546 -0.0648831 -0.1567338 -0.0092348 -0.082837 0.0477234 0.0193203 0.051567 -0.0229583 0.0291014 0.0533509 -0.1229743 -0.0096148 0.0329993 -0.0461579 0.0878121 -0.0074373 0.0335211 -0.0039235 0.1413099 0.0106833 0.0987594 0.0308887 0.0951011 -0.0696377 -0.041362 0.0379093 -0.0460314 0.1418844 0.3178816 0.0895417 0.0311662 0.1403616 0.2086065 0.0148431 0.0052656 0.0353498 0.1610061 0.0024715 0.0940865 -0.048232 0.0300337 0.3941232 -0.008139 -0.0170442 0.0311051 0.1226782 0.2548524 0.1326205 -0.0246763 0.1746433 0.2166194 -0.1391019 0.0082744 -0.0587421 0.0512528 0.3543 0.0548752 0.0780307 0.0528041 0.3416169 -0.0583662 0.1180695 -0.0898986 0.2129747 unknown
polarizability: 141.6331428|-8.6254407|129.180935|-11.5639834|0.8222317|79.0245791 unknown
InChI: InChI=1S/C9H12N2O2/c10-5-7-2-1-3-8(4-7)6-11-9(12)13/h1-4,11-12H,5-6,10H2
charge 0 multiplicity 1
25 atoms
O  -3.810369 1.370806 -0.694567
O  -3.441251 0.71494 1.534478
N  -2.302963 -0.283654 -0.270271
N  2.572942 2.475947 -1.033783
C  -0.003327 -1.099122 0.273159
C  2.031796 0.297919 0.166456
C  0.635087 0.16181 0.360638
C  -1.503487 -1.230634 0.522065
C  0.775543 -2.2464 -0.016471
C  2.695283 1.678873 0.211797
C  2.795616 -0.866143 -0.110111
C  2.17181 -2.129806 -0.203702
C  -3.189199 0.588167 0.307925
H  0.032323 1.050267 0.593603
H  -1.828369 -2.268172 0.310676
H  -1.747254 -1.020467 1.580147
H  0.292565 -3.228863 -0.089296
H  2.260527 2.279632 1.031998
H  3.772149 1.565191 0.435878
H  3.881014 -0.779984 -0.248442
H  2.770556 -3.022105 -0.41862
H  -2.200242 -0.260656 -1.28544
H  1.613154 2.776119 -1.236493
H  2.998891 2.024474 -1.850692
H  -4.448796 1.984563 -0.249832
