program: Gaussian 09
title: 000104125
version: EM64L-G09RevD.01
frameworkgroup: C1[X(C12H13NO3S)]
method: RPBEPBE
basis: SDD
operation: Freq
keyword: #p
keyword: freq=noraman
keyword: PBEPBE/SDD
title: #p freq=noraman PBEPBE/SDD
converged: YES YES NO NO
title: Mulliken charges:
elementType: S O O O N C C C C C C C C C C C C H H H H H H H H H H H H H
charge: 0.871538 -0.578314 -0.542530 -0.442043 -0.694976 -0.076515 -0.552015 0.388332 0.441227 -0.432462 -0.278733 -0.415746 -0.297087 -0.406040 -0.621418 0.533385 -0.430784 0.263518 0.276952 0.296682 0.285951 0.246725 0.226384 0.232380 0.246278 0.235391 0.225882 0.313921 0.314329 0.369787
chargesum: 0.00000
title: Mulliken charges with hydrogens summed into heavy atoms:
elementType: S O O O N C C C C C C C C C C C C
charge: 0.871538 -0.578314 -0.542530 -0.072256 -0.066726 -0.076515 -0.011545 0.388332 0.441227 -0.135780 0.007218 -0.169021 0.161677 -0.159762 -0.386027 0.533385 -0.204902
polarizability: 3.07291597e+02 1.74418975e+01 1.69628655e+02 -2.84654348e+00 1.08645821e+01 9.74044866e+01
1716.lowfreq: -11.7117 -2.7234 0.0008 0.0010 0.0020 5.9033 21.5605 30.7800 48.9922
frequency: 21.4162 30.7535 48.8580 99.4245 108.7424 173.1176 184.1817 192.8852 203.3404 217.9664 255.5164 259.8066 316.3079 343.4006 366.6180 388.9028 395.0858 403.5052 429.2268 439.7941 468.2318 473.7406 506.6162 516.5845 535.2687 570.9235 636.3948 663.5274 669.0902 729.0264 762.6443 775.2008 784.8680 815.3556 820.5622 834.8451 885.1465 889.1814 890.8778 913.0405 919.8194 947.0490 967.7872 974.9722 1010.2331 1031.2909 1046.2608 1052.7312 1137.2914 1145.6657 1159.9430 1176.9641 1206.0098 1229.9103 1258.3382 1274.1417 1329.1560 1340.6488 1351.8850 1377.9115 1413.1770 1416.5511 1427.1639 1445.1148 1457.7350 1469.4486 1521.6846 1577.5427 1599.5371 1642.0675 1650.4613 2962.5328 3042.8831 3053.2534 3120.9199 3123.2490 3134.0834 3138.7641 3144.1983 3148.1449 3161.1958 3315.5778 3562.8957 3702.2664
redmass: 6.6896 4.8344 4.4193 6.8974 4.7676 4.2670 3.7574 5.8075 4.8448 7.5823 5.8783 3.9445 6.5078 4.1403 4.9438 1.1327 3.6896 2.4104 1.3035 3.6405 4.1070 2.4961 4.1365 6.2577 6.2976 3.9016 6.7951 2.3075 1.2778 6.3849 11.8765 2.4016 5.0319 1.3074 1.5969 2.3616 3.6597 2.2517 4.3662 1.5013 1.8148 3.3804 1.4040 1.3613 2.4240 2.7390 1.5538 2.1060 1.5240 1.2293 1.2046 1.1469 1.4885 1.4723 1.2196 1.7488 2.8236 1.7756 1.2275 1.1053 2.9426 1.1772 6.0688 5.9827 1.0807 3.0980 4.2633 7.1715 6.1517 2.1823 1.8352 1.0663 1.0663 1.0847 1.0908 1.0877 1.0886 1.0921 1.1106 1.0977 1.0964 1.0664 1.0452 1.1040
irintensity: 2.0089 1.3067 3.6055 1.3397 2.9641 8.8085 1.8530 12.8487 5.2783 1.0664 4.8478 16.3692 3.6770 6.3395 17.9032 96.6734 28.6974 1.4185 215.6628 0.5696 27.9579 14.3746 0.8426 10.4090 50.5094 51.4773 23.0835 69.1028 185.8964 3.5337 82.1330 0.2800 24.0577 11.0140 26.1703 7.4614 22.2487 73.7923 10.4954 14.2564 59.4179 1.8110 0.7809 3.1438 62.8551 77.6249 7.5591 47.9173 7.7024 0.6720 24.4050 24.8655 22.4085 29.8511 6.6247 5.1907 70.3297 6.0965 1.4143 9.1355 3.2467 99.3810 6.9949 17.0086 8.9082 44.7161 84.8303 4.1779 3.8892 38.9848 519.4771 45.5778 6.4846 14.8728 11.5916 15.2822 9.1389 3.0869 3.3631 19.1134 8.1460 169.4461 136.7515 24.5572
temp: 298.150 k
press: 1.00000 atm
elementType: 16 8 8 8 7 6 6 6 6 6 6 6 6 6 6 6 6 1 1 1 1 1 1 1 1 1 1 1 1 1
symmnumber: 1
zpe: 599259.9 jmol-1
zpe.correction: 0.228246 hartree
zpe.thermalcorrener: 0.244578 hartree
zpe.thermalcorrenthalpy: 0.245522 hartree
zpe.thermalcorrgfe: 0.183395 hartree
zpe.sumelectzpe: -1142.170864 hartree
zpe.sumelectthermal: -1142.154532 hartree
zpe.sumelectthermalent: -1142.153588 hartree
zpe.sumelectthermalfe: -1142.215716 hartree
dipole: -9.2100 0.6127 4.1373
dipole: 10.1151
quadrupole: -83.6525 -108.4478 -114.1928
quadrupole: 7.8869 9.0389 7.5343
quadrupole: 18.4452 -6.3501 -12.0951 7.8869 9.0389 7.5343
hfenergy: -1142.3991103 hartree
pointgroup: C01 [X(C12H13N1O3S1)]
dipole: -3.6521083 0.3745267 1.535932 debye
polarizability: 307.6275468|16.0136572|170.4659588|0.3090008|6.4613212|96.2312327 unknown
InChI: InChI=1S/C12H13NO3S/c13-11-3-1-10-8-12(4-2-9(10)7-11)17(15,16)6-5-14/h1-4,7-8,14H,5-6,13H2
charge 0 multiplicity 1
30 atoms
S  2.695402 0.410323 -0.37732
O  3.001782 -0.978156 -1.230077
O  3.263845 1.856731 -0.890248
O  4.682182 -1.971672 0.764164
N  -5.571379 -0.190032 0.27281
C  0.832887 0.54081 -0.163791
C  3.452844 0.088436 1.394392
C  -1.345132 -0.517915 -0.140462
C  -1.953815 0.779698 0.102478
C  0.073604 -0.618081 -0.276625
C  0.279867 1.833726 0.046461
C  -1.104912 1.939234 0.181609
C  4.81652 -0.59196 1.208764
C  -2.198594 -1.667058 -0.24016
C  -3.369309 0.875753 0.239413
C  -4.188979 -0.267544 0.14102
C  -3.576452 -1.551838 -0.104003
H  3.49518 1.096188 1.838559
H  2.726657 -0.567184 1.900219
H  0.551935 -1.580314 -0.493657
H  0.933764 2.711496 0.067348
H  -1.562046 2.922159 0.34283
H  5.453256 0.01135 0.526085
H  5.316963 -0.633513 2.193126
H  -1.748075 -2.648252 -0.428419
H  -3.821562 1.858725 0.420597
H  -4.214783 -2.440099 -0.183145
H  -6.03177 0.700246 0.439828
H  -6.150634 -1.020728 0.192421
H  4.210654 -1.941926 -0.122617
