program: Gaussian 09
title: 000104097
version: EM64L-G09RevD.01
frameworkgroup: C1[X(C4H8O3S)]
method: RPBEPBE
basis: SDD
operation: Freq
keyword: #pfreq=noraman
keyword: PBEPBE/SDD
title: #p freq=noraman PBEPBE/SDD
converged: YES YES NO NO
title: Mulliken charges:
elementType: S O O O C C C C H H H H H H H H
charge: 0.682280 -0.248561 -0.601842 -0.235897 -0.707432 0.306635 -0.808283 -0.496599 0.264744 0.309733 0.248478 0.278361 0.279996 0.239297 0.247001 0.242087
chargesum: 0.00000
title: Mulliken charges with hydrogens summed into heavy atoms:
elementType: S O O O C C C C
charge: 0.682280 -0.248561 -0.601842 -0.235897 -0.132954 0.306635 -0.001447 0.231787
polarizability: 1.06703114e+02 2.89715831e-01 7.82675579e+01 1.89965920e-02 -6.41005206e-01 5.47283045e+01
1716.lowfreq: -16.9376 -5.6655 -1.9660 -0.0024 -0.0023 -0.0018 18.5883 38.3626 90.5194
frequency: 8.5351 38.2940 90.5024 107.6962 175.0241 180.4553 202.9361 249.9276 264.5886 286.4846 388.4566 451.2861 544.1882 626.7776 718.1489 785.9849 811.5171 885.2511 941.1966 960.0378 979.4076 1075.3947 1112.4100 1149.6932 1176.5080 1237.9970 1302.3477 1398.9809 1417.8589 1422.5607 1436.0753 1453.2567 1461.6095 1622.7841 3006.8713 3015.5686 3066.6837 3109.4122 3155.2026 3157.6654 3162.2998 3172.9653
redmass: 5.3016 4.6343 1.2099 2.9548 1.1361 3.6053 4.0498 4.9409 3.3891 4.5146 3.0134 5.5486 6.7207 4.8696 6.4560 3.6809 9.5917 1.8999 1.2921 1.3859 5.1071 1.5690 1.2688 1.4260 1.1981 2.6044 1.1407 1.1304 1.0548 1.1961 1.0588 1.0497 1.0517 9.1973 1.0296 1.0261 1.0546 1.1047 1.1048 1.1065 1.1059 1.1127
irintensity: 6.8710 7.7514 0.4798 0.0833 0.3960 3.2601 3.5280 22.8309 7.1587 7.7193 2.8274 27.0105 15.5644 2.7659 6.1413 17.5951 33.8319 4.6378 15.9760 10.4327 20.2113 123.1257 0.1627 12.5217 5.6546 269.2201 5.0623 20.2448 13.3122 34.4863 15.5204 15.8897 9.6046 224.2918 28.9915 5.9021 3.0568 23.8157 13.5058 6.8406 2.5870 0.5860
temp: 298.150 k
press: 1.00000 atm
elementType: 16 8 8 8 6 6 6 6 1 1 1 1 1 1 1 1
symmnumber: 1
zpe: 309897.7 jmol-1
zpe.correction: 0.118034 hartree
zpe.thermalcorrener: 0.128793 hartree
zpe.thermalcorrenthalpy: 0.129737 hartree
zpe.thermalcorrgfe: 0.079072 hartree
zpe.sumelectzpe: -780.214844 hartree
zpe.sumelectthermal: -780.204085 hartree
zpe.sumelectthermalent: -780.203141 hartree
zpe.sumelectthermalfe: -780.253806 hartree
dipole: -0.2497 -2.5694 1.4948
dipole: 2.9830
quadrupole: -42.2839 -64.1145 -55.4277
quadrupole: 12.6889 -0.0615 -3.6529
quadrupole: 11.6582 -10.1725 -1.4856 12.6889 -0.0615 -3.6529
hfenergy: -780.3328781 hartree
pointgroup: C01 [X(C4H8O3S1)]
dipole: 0.1354327 -0.941206 0.6878561 debye
dipolederiv: 0.7652846 0.0328751 -0.0804832 0.1698007 0.6832393 -0.2718189 -0.1026879 -0.4191424 0.5671385 -1.1913215 0.1202213 -0.3017125 0.2396215 -0.3202957 -0.0298062 -0.6001878 -0.0068796 -0.6850237 -0.4109668 0.0089366 0.0292626 -0.0289185 -0.4826989 -0.0909114 0.1147353 0.3739556 -0.5366435 -0.6342766 0.0735209 0.1626797 0.1796363 -0.3394713 -0.2757499 0.0069672 -0.0466831 -0.9404843 -0.7027669 -0.0380367 0.2919246 -0.0483171 -0.1142681 0.088998 0.126505 -0.0157895 -0.0802219 1.5844517 -0.1517997 -0.0075672 -0.6436928 0.1820304 0.4321169 0.4640787 0.0979362 1.3226007 -0.1532037 0.068974 -0.053696 0.1209312 -0.1316655 0.0888359 -0.0496374 0.0099208 -0.0383761 0.6331933 -0.0687189 0.0766255 -0.1202203 0.3022366 -0.0547523 0.0272987 -0.0260871 0.234333 0.0261618 0.024194 -0.0251833 0.0478568 0.044155 0.0380203 -0.0426065 0.0664225 0.0139748 0.0557132 -0.0198262 0.0318863 -0.0125512 0.0341601 -0.0184275 0.0467079 -0.041605 0.0185198 0.0377257 0.0299081 -0.008743 0.0780461 0.0747727 0.0703873 -0.0204177 0.046476 -0.074852 -0.0291918 -0.0369882 0.0110185 -0.0450829 0.0537233 0.0343021 0.029837 0.0299616 0.1079888 0.0606905 -0.0025835 -0.0571236 0.031202 -0.0280781 -0.0541571 -0.0252764 -0.0694263 0.0403761 0.0175672 0.0137687 -0.0647756 0.0125464 0.1144781 -0.0231772 -0.1211482 -0.0073645 -0.0508539 -0.0156366 -0.0491278 -0.0271287 0.0396493 -0.0964562 -0.0202144 0.0204037 -0.0664707 0.0941051 -0.0434241 -0.0053176 0.0230159 -0.0205075 0.0241383 0.0863546 0.1254282 0.0747757 0.0074186 unknown
polarizability: 106.3329111|-2.5211741|58.8958797|-3.1744426|-8.7594193|74.4701856 unknown
InChI: InChI=1S/C4H8O3S/c1-7-4(5)3-8(2)6/h3H2,1-2H3
charge 0 multiplicity 1
16 atoms
S  1.625255 0.342617 -0.160936
O  -1.900755 -0.417351 -0.576765
O  1.599651 0.600804 -1.802132
O  -1.34466 0.006635 1.654045
C  0.257931 -1.096391 0.163344
C  -1.0502 -0.461171 0.526645
C  3.128734 -0.841896 0.094658
C  -3.202815 0.259265 -0.356521
H  0.657057 -1.671501 1.010784
H  0.239805 -1.64866 -0.786376
H  3.187228 -1.130349 1.15524
H  4.009247 -0.261392 -0.215772
H  2.980272 -1.708257 -0.566712
H  -3.716661 0.196213 -1.325232
H  -3.03813 1.30858 -0.059874
H  -3.772058 -0.257645 0.434202
