program: Gaussian 09
title: 000104098
version: EM64L-G09RevD.01
frameworkgroup: C1[X(C8H7ClO3)]
method: RPBEPBE
basis: SDD
operation: Freq
keyword: #p
keyword: freq=noraman
keyword: PBEPBE/SDD
title: #p freq=noraman PBEPBE/SDD
converged: YES YES NO NO
title: Mulliken charges:
elementType: Cl O O O C C C C C C C C H H H H H H H
charge: -0.058551 -0.303485 -0.363426 -0.213334 0.147509 0.272907 -0.299384 -0.283278 -0.231043 -0.221566 0.192756 -0.499038 0.285536 0.239995 0.260049 0.359597 0.242256 0.229628 0.242873
chargesum: 0.00000
title: Mulliken charges with hydrogens summed into heavy atoms:
elementType: Cl O O O C C C C C C C C
charge: -0.058551 -0.303485 -0.003829 -0.213334 0.147509 0.272907 -0.013848 -0.283278 0.008952 0.038482 0.192756 0.215719
polarizability: 1.56208331e+02 2.09371237e+00 1.19520201e+02 9.30065930e-02 -2.57211433e-03 4.60331561e+01
1716.lowfreq: -7.5411 -5.8671 -0.0039 -0.0032 -0.0023 4.9186 20.2510 71.3548 110.8186
frequency: 19.7656 71.3517 110.8142 139.4406 144.6204 203.5079 240.0789 267.4031 299.4053 320.8355 360.9192 399.0105 468.1714 499.6900 540.0344 543.1278 576.0265 678.8554 684.3674 744.7812 771.4459 792.0044 811.5808 922.5523 931.9472 984.4776 1042.7655 1076.2657 1114.9157 1125.8996 1145.0868 1169.2331 1222.7870 1240.5312 1288.8207 1388.0589 1423.3731 1426.8828 1451.3548 1463.0260 1465.3711 1573.1864 1602.1543 1638.2566 3001.9907 3102.1710 3145.0453 3156.1345 3175.4988 3194.2025 3454.5391
redmass: 7.0015 5.5507 1.1810 5.2269 3.5804 4.4831 7.3049 5.7741 7.6482 5.0718 8.5652 9.7813 3.6676 1.2028 3.7049 4.8759 8.8667 8.3064 6.9623 2.4000 6.2196 1.8821 6.2757 1.3623 8.1697 1.3438 6.0385 2.3707 1.2638 2.3587 1.4385 1.1237 2.4971 2.6468 1.7893 4.5410 1.2443 2.7520 1.0495 2.9264 1.0522 7.0702 6.8803 10.5758 1.0296 1.1043 1.1045 1.0877 1.0950 1.0965 1.0644
irintensity: 0.9355 0.9419 0.7471 1.3231 6.2165 1.1734 6.0290 0.9587 3.9174 12.8592 1.2550 4.0981 2.4266 140.2395 1.8187 15.4533 19.0282 1.3539 32.7844 58.8234 52.0945 25.4895 20.1299 0.0713 11.4135 1.4286 109.7176 36.7051 0.1401 165.4158 57.8371 18.1115 248.9756 93.7940 34.3946 60.8384 23.6898 48.0691 13.8360 25.1460 13.5614 10.5090 8.2687 213.3517 41.7508 27.8172 16.8124 3.9575 3.0633 3.7247 66.1591
temp: 298.150 k
press: 1.00000 atm
elementType: 17 8 8 8 6 6 6 6 6 6 6 6 1 1 1 1 1 1 1
symmnumber: 1
zpe: 350588.2 jmol-1
zpe.correction: 0.133532 hartree
zpe.thermalcorrener: 0.145065 hartree
zpe.thermalcorrenthalpy: 0.146009 hartree
zpe.thermalcorrgfe: 0.094536 hartree
zpe.sumelectzpe: -993.899366 hartree
zpe.sumelectthermal: -993.887834 hartree
zpe.sumelectthermalent: -993.886889 hartree
zpe.sumelectthermalfe: -993.938363 hartree
dipole: -0.1821 2.8095 -0.0383
dipole: 2.8156
quadrupole: -63.0450 -73.9845 -77.8785
quadrupole: 3.5702 -0.0971 0.2557
quadrupole: 8.5910 -2.3485 -6.2425 3.5702 -0.0971 0.2557
hfenergy: -994.0328982 hartree
pointgroup: C01 [X(C8H7Cl1O3)]
dipole: -0.1959138 -1.0902802 0.0026979 debye
dipolederiv: -0.576486 0.2612894 -0.013774 0.3085293 -0.3628898 0.0062067 -0.0128577 0.0044736 -0.0508097 -1.5019544 0.2595198 -0.0528289 0.5386514 -0.6479413 0.0314483 -0.0652492 0.0187505 -0.3079895 -0.1034975 -0.0338245 0.0065604 0.1599643 -1.2216499 -0.0047225 0.0100368 -0.0123061 -0.3547214 -0.7268121 -0.2475913 -0.0111336 -0.0894783 -0.8070781 0.0131352 -0.0204794 0.0038889 -0.3040871 -0.6315185 0.0495843 -0.0187158 -0.4018888 -0.19601 -0.0115655 -0.0212801 0.0021721 -0.0329682 -0.0396482 0.2326745 -0.0028104 -0.0623807 1.0242508 0.0092601 -0.0018328 0.0194836 0.1159189 0.1797071 -0.0488583 0.008557 0.3187124 0.0434964 0.0119401 0.0068312 -0.0020632 -0.100891 0.7513996 -0.7218365 0.0190622 -0.461564 0.1279196 -0.0117373 0.0208602 -0.0202602 -0.1073512 -0.3615725 0.0412085 -0.004966 0.0705583 0.0418089 0.0044101 -0.0044675 0.0031893 -0.1925613 -0.0369915 0.0853334 0.0015453 -0.1237589 0.0568466 -0.003004 -0.0003301 0.0039338 -0.0581055 2.031897 0.0061199 0.0696465 -0.2513691 1.1658015 -0.0416598 0.0827477 -0.0225994 0.2505452 0.7668277 -0.0535157 0.0184521 0.0345972 0.2228903 0.0018371 0.0212419 -0.0022948 0.2814829 0.0795468 0.0708688 -0.0010726 0.0795186 0.0768283 0.0016474 -0.0001305 0.0024589 0.1582989 0.0573912 -0.013024 -0.0036365 -0.0297424 -0.0918429 -0.0034919 -0.0032388 -0.0029872 0.1702783 -0.0197233 -0.0488476 -0.0062161 -0.0379224 0.0991136 -0.0018603 -0.0062658 -0.0020679 0.1634411 0.2083977 0.0712074 -0.0041324 -0.0041933 0.4237443 0.0003068 -0.0051667 0.0025594 0.3661233 -0.0351946 0.0078485 0.005365 -0.0948369 0.0559455 0.0945687 0.0614189 0.0741306 -0.0628689 -0.0148264 0.0674556 -0.0076928 0.1371944 -0.0562446 0.0120007 -0.0094946 0.0088715 0.1201044 -0.0269422 0.0143876 -0.0022094 -0.0905912 0.0450107 -0.1087196 -0.0523434 -0.0793333 -0.0538394 unknown
polarizability: 155.1607207|-6.1577588|120.4526052|3.5134392|0.2024006|46.1483621 unknown
InChI: InChI=1S/C8H7ClO3/c1-12-8(11)5-3-2-4-6(9)7(5)10/h2-4,10H,1H3
charge 0 multiplicity 1
19 atoms
Cl -3.584841 1.264331 -0.071657
O  2.610514 -0.676919 0.140784
O  -0.674443 2.084981 0.027802
O  2.034815 1.576579 0.06461
C  0.282484 -0.160806 0.033588
C  -0.849592 0.71322 0.006524
C  0.064067 -1.565956 0.014178
C  -2.144324 0.124179 -0.039235
C  -1.230108 -2.115149 -0.032046
C  -2.356633 -1.258787 -0.059366
C  1.674451 0.378771 0.078439
C  4.025649 -0.248958 0.184915
H  0.942214 -2.214557 0.036221
H  -1.372223 -3.199425 -0.046983
H  -3.373995 -1.658561 -0.095132
H  -1.562192 2.538405 0.005345
H  4.282818 0.322341 -0.72318
H  4.60007 -1.184512 0.240876
H  4.208269 0.384223 1.069617
