program: Gaussian 09
title: 000104146
version: EM64L-G09RevD.01
frameworkgroup: C1[X(C15H20O3Si)]
method: RPBEPBE
basis: SDD
operation: Freq
keyword: #p
keyword: freq=noraman
keyword: PBEPBE/SDD
title: #p freq=noraman PBEPBE/SDD
converged: YES YES NO NO
title: Mulliken charges:
elementType: Si O O O C C C C C C C C C C C C C C C H H H H H H H H H H H H H H H H H H H H
charge: 1.550979 -0.619193 -0.643781 -0.609057 -0.229305 -0.275374 -0.300750 -0.235434 -0.225318 -0.227595 0.467013 0.489728 0.483919 -0.759982 -0.777568 -0.758606 -0.688819 -0.690889 -0.693675 0.239302 0.262852 0.231300 0.231515 0.231741 0.226333 0.230029 0.238912 0.230023 0.249444 0.261630 0.222391 0.237586 0.236561 0.258173 0.223838 0.230243 0.225229 0.253245 0.223361
chargesum: 0.00000
title: Mulliken charges with hydrogens summed into heavy atoms:
elementType: Si O O O C C C C C C C C C C C C C C C
charge: 1.550979 -0.619193 -0.643781 -0.609057 -0.229305 -0.036072 -0.037898 -0.004134 0.006197 0.004146 0.467013 0.489728 0.483919 -0.064707 -0.036471 -0.062068 -0.206808 -0.235417 -0.217070
polarizability: 1.99537226e+02 9.21085693e-01 1.76398392e+02 1.01290840e+01 3.00255081e+01 1.97230359e+02
1716.lowfreq: -14.4668 -8.2080 -7.4460 0.0013 0.0014 0.0014 6.7883 27.0628 27.7486
frequency: -4.7289 26.9590 27.6195 34.1977 35.2231 38.2830 45.9597 57.8367 68.0822 120.1445 133.7762 143.8543 176.0070 176.3359 198.8376 208.5196 217.2292 229.0304 253.2281 272.3166 285.3900 380.6313 392.9250 402.7791 409.9184 467.4292 475.9912 481.3237 485.1909 491.4915 498.1646 520.6498 590.1049 613.6017 663.2928 685.9112 704.2741 706.9085 712.9002 714.1241 721.6340 751.9586 859.6422 879.8494 880.2886 883.4704 887.3589 896.4621 900.5337 929.5799 974.9050 980.5038 982.1765 987.2513 1000.0899 1002.8640 1022.1925 1026.7228 1032.1636 1036.0456 1053.8483 1054.4898 1058.4730 1077.7450 1117.7196 1175.0521 1196.7970 1246.2351 1255.0841 1275.9367 1314.1789 1371.2165 1390.0057 1391.5169 1392.7147 1406.3173 1412.3094 1419.9904 1421.9081 1451.4760 1452.3723 1460.7245 1468.6282 1469.6001 1471.3822 1472.1914 1579.7178 1601.7095 1655.4322 1658.1186 1679.3450 2977.4874 2984.7757 2987.0902 3057.8639 3065.3478 3068.5510 3107.0146 3110.2462 3110.5320 3117.6017 3118.3468 3122.9380 3126.7507 3129.8276 3141.4669 3152.5154 3164.9594 3226.8649 3230.0476 3240.1835
redmass: 3.6825 3.0621 3.7393 3.1764 3.6882 3.1059 4.2513 3.9313 4.1416 5.2024 4.5642 4.8213 1.1064 1.0816 4.3351 1.3789 5.3139 2.7624 4.4343 4.3412 4.0326 2.8951 2.7718 2.5357 3.2132 3.2229 2.7864 2.6443 2.4347 2.8317 4.0809 3.9265 5.7750 6.4394 6.0475 6.0392 1.7714 1.5470 1.3335 1.2638 1.6944 1.7845 1.2503 1.7752 1.5063 1.4424 1.3777 2.8836 2.7190 1.3499 1.7943 1.8026 1.4142 5.3285 1.5796 1.3231 2.2963 2.1152 2.1330 2.8110 1.4973 1.4969 1.4942 1.6843 3.0544 1.0568 1.1290 3.6650 3.4901 3.6220 1.3802 5.7672 1.1806 1.1880 1.1885 1.2548 1.2552 1.2593 2.0655 1.0453 1.0457 1.0431 1.0658 1.0560 1.8678 1.1054 5.6352 5.8190 5.4087 5.3539 5.7153 1.0375 1.0369 1.0365 1.0981 1.0977 1.0978 1.0982 1.0991 1.0994 1.0636 1.0625 1.0854 1.0626 1.0881 1.0923 1.0964 1.1016 1.1147 1.1153 1.1159
irintensity: 0.0046 0.3718 0.2713 0.4454 0.1663 0.4844 0.9878 0.4673 0.5229 1.1758 3.9902 1.3018 0.0731 0.3615 0.4699 0.9292 17.0153 2.5954 22.7984 5.5889 3.0784 11.6648 0.0152 8.8731 14.8694 20.7081 8.0262 8.3595 2.4069 5.7932 62.6182 46.1155 33.1886 0.6275 85.9420 58.2095 66.6922 10.5983 11.1960 12.9867 23.3945 19.7617 1.5521 19.4504 30.8707 169.7022 101.3974 55.3161 105.4591 0.9425 103.7511 90.1225 3.8325 5.4993 42.7000 0.1627 36.2392 108.8729 118.1517 205.9467 3.3152 6.4401 10.1064 1.1493 82.5735 0.5833 9.0295 367.2126 423.2839 134.6521 2.1616 0.0374 18.4141 45.4884 38.5522 13.3005 10.1837 1.4275 18.1332 15.9422 14.5559 14.0525 15.5729 23.5775 0.8642 30.5530 0.0178 2.5927 173.0135 64.9469 147.1035 11.1806 18.9417 19.0276 9.2214 17.5431 16.9035 24.5857 22.3056 25.7295 0.0707 0.8992 0.8483 0.1310 1.9538 13.4029 25.2594 26.1290 13.3014 10.8956 11.9017
temp: 298.150 k
press: 1.00000 atm
elementType: 14 8 8 8 6 6 6 6 6 6 6 6 6 6 6 6 6 6 6 1 1 1 1 1 1 1 1 1 1 1 1 1 1 1 1 1 1 1 1
symmnumber: 1
zpe: 816300.5 jmol-1
zpe.correction: 0.310912 hartree
zpe.thermalcorrener: 0.332557 hartree
zpe.thermalcorrenthalpy: 0.333501 hartree
zpe.thermalcorrgfe: 0.257431 hartree
zpe.sumelectzpe: -1097.263707 hartree
zpe.sumelectthermal: -1097.242062 hartree
zpe.sumelectthermalent: -1097.241118 hartree
zpe.sumelectthermalfe: -1097.317188 hartree
dipole: 1.1292 0.3292 1.0193
dipole: 1.5564
quadrupole: -109.0841 -118.7097 -114.1956
quadrupole: -0.7918 -0.8992 0.7033
quadrupole: 4.9124 -4.7132 -0.1992 -0.7918 -0.8992 0.7033
hfenergy: -1097.5746189 hartree
pointgroup: C01 [X(C15H20O3Si1)]
dipole: -0.5081591 -0.0520905 -0.33767 debye
polarizability: 202.6618464|4.797403|168.834272|16.4447629|-22.4366847|201.6698597 unknown
InChI: InChI=1S/C15H20O3Si/c1-12(2)16-19(17-13(3)4,18-14(5)6)15-10-8-7-9-11-15/h7-11H,1,3,5H2,2,4,6H3
charge 0 multiplicity 1
39 atoms
Si 0.234736 0.148329 0.120796
O  0.606328 -0.183734 -1.540848
O  1.384597 -0.439965 1.239863
O  0.312429 1.865211 0.245468
C  -1.404029 -0.611609 0.615883
C  -2.494841 -0.626745 -0.295399
C  -1.580825 -1.154207 1.917016
C  -3.739892 -1.171815 0.089271
C  -2.825782 -1.701843 2.298479
C  -3.907144 -1.708995 1.386746
C  0.98466 -1.38799 -2.174657
C  2.760665 -0.18221 1.437667
C  -0.358381 2.895975 -0.447398
C  0.894871 -1.24723 -3.673048
C  3.450159 0.60339 0.344914
C  -0.451974 4.134645 0.407378
C  1.389629 -2.494696 -1.497542
C  3.343555 -0.672546 2.558716
C  -0.820427 2.76148 -1.718083
H  -2.372865 -0.220865 -1.306634
H  -0.740055 -1.156789 2.619362
H  -4.574423 -1.179004 -0.620601
H  -2.950992 -2.122485 3.30241
H  -4.87284 -2.133717 1.683944
H  1.217678 -2.172713 -4.176078
H  -0.14284 -1.017837 -3.97893
H  1.530576 -0.410928 -4.017382
H  4.514422 0.749429 0.588693
H  3.381857 0.07068 -0.623004
H  2.975742 1.594239 0.215809
H  -0.935184 4.958272 -0.142391
H  -1.028641 3.926938 1.327313
H  0.557977 4.457099 0.720791
H  1.445336 -2.528411 -0.404595
H  1.673206 -3.39498 -2.047403
H  2.764763 -1.235153 3.295849
H  4.408294 -0.511989 2.742763
H  -0.665678 1.842119 -2.290874
H  -1.328267 3.59745 -2.204764
