program: Gaussian 09
title: 000104143
version: EM64L-G09RevD.01
frameworkgroup: C1[X(C14H16N2O4S)]
method: RPBEPBE
basis: SDD
operation: Freq
keyword: #p
keyword: freq=noraman
keyword: PBEPBE/SDD
title: #p freq=noraman PBEPBE/SDD
converged: NO YES NO NO
title: Mulliken charges:
elementType: S O O O O N N C C C C C C C C C C C C C C H H H H H H H H H H H H H H H H
charge: 0.946826 -0.303556 -0.303847 -0.516624 -0.541684 -0.527957 -0.680936 -0.380759 0.476980 -0.295889 0.211667 0.365694 -0.507359 0.352532 -0.316235 -0.362149 -0.213374 -0.203671 -0.245045 -0.528686 -0.531009 0.304737 0.304789 0.241587 0.279824 0.224344 0.346898 0.308650 0.228660 0.223981 0.227875 0.217267 0.236283 0.252193 0.233328 0.240797 0.233866
chargesum: 0.00000
title: Mulliken charges with hydrogens summed into heavy atoms:
elementType: S O O O O N N C C C C C C C C C C C C C C
charge: 0.946826 -0.303556 -0.303847 -0.516624 -0.541684 -0.223168 -0.025388 -0.380759 0.476980 0.008848 0.211667 0.365694 -0.265772 0.352532 -0.036410 -0.137805 0.015286 0.020310 -0.017171 0.177058 0.176982
polarizability: 2.35288297e+02 8.30864005e+00 2.23811612e+02 -4.56741087e+00 9.75760465e-01 2.04411799e+02
1716.lowfreq: -14.6669 -6.1532 -0.0404 -0.0018 -0.0014 2.5277 16.9866 24.7048 41.5513
frequency: 16.8705 24.6705 41.5186 54.6674 71.9057 90.2251 101.1461 113.1574 133.1216 160.6803 167.0807 194.8284 195.7166 206.6112 217.8281 235.6357 250.2699 264.9954 276.7563 311.8686 317.8005 363.3615 392.2610 401.5261 416.3747 426.5166 442.4550 454.2444 456.1896 474.3436 512.1748 529.5393 561.7769 573.1692 608.1828 612.6519 672.3641 689.4040 693.0256 739.5101 767.1946 770.8248 800.5704 817.4671 832.9013 850.9993 877.1278 884.6509 908.7757 928.2856 953.9062 968.6592 984.3963 989.6021 992.1821 1007.7681 1022.3411 1056.5736 1078.4663 1113.2989 1116.4037 1155.1807 1159.4318 1170.3174 1178.2228 1180.5856 1186.1165 1231.4590 1248.0616 1252.5998 1316.1685 1336.9638 1391.3702 1410.1092 1419.0060 1439.5559 1447.9109 1454.0154 1465.1554 1466.3875 1473.6491 1474.0135 1475.0917 1514.9899 1581.9602 1594.8543 1600.8639 1608.8224 1630.5495 2969.1790 2969.9183 3060.1347 3064.4649 3118.5951 3130.2054 3130.9954 3132.0118 3142.9473 3152.3846 3156.4157 3161.2037 3180.5332 3361.9366 3557.2088 3706.1464
redmass: 5.7457 4.3252 4.1297 3.0384 5.5033 5.3054 4.9831 4.7932 4.8483 3.1235 4.9234 3.6870 4.2309 1.6593 3.8920 2.9339 1.8953 3.7159 5.0531 3.8380 5.3102 4.0568 1.9315 3.1162 3.4690 3.3126 3.7658 3.7953 4.6447 5.5162 3.9943 1.1250 5.5103 5.8635 4.0721 6.2599 8.0787 1.8530 6.6594 1.8450 1.7871 5.2452 5.1771 5.9799 1.3157 2.4386 1.5305 1.5090 1.4846 5.3442 8.2991 1.4105 6.1321 1.3246 8.8810 3.6145 2.1292 1.5486 1.5603 1.2532 1.2596 1.3873 1.3806 1.0568 2.4356 1.1454 3.2765 3.1833 1.4889 1.3065 4.2424 1.2697 5.9681 2.9006 3.3443 1.1979 2.1912 1.7685 1.0549 1.0483 1.9824 1.1321 1.0626 4.0563 5.8770 3.6876 5.8456 3.1011 1.9430 1.0324 1.0327 1.1045 1.1038 1.0863 1.1005 1.0877 1.1006 1.0938 1.0905 1.0908 1.0985 1.0970 1.0745 1.0447 1.1042
irintensity: 0.8172 0.3176 0.1224 5.0504 0.8543 2.9202 2.2018 4.7277 7.5943 0.0435 9.4915 1.4504 2.4927 0.8008 0.8615 1.0102 0.4830 1.7739 8.0458 3.4432 2.6238 51.1892 40.3260 5.2599 7.2552 79.9964 24.9625 29.0079 105.8727 72.1940 1.6930 122.0548 2.0764 34.4168 1.4963 2.9663 4.4274 44.8565 2.4495 2.3272 67.8184 6.9295 32.8527 52.0293 6.8897 45.3088 144.7096 7.9603 4.8896 25.5888 53.6946 0.7026 0.2803 0.7902 71.1147 64.2194 5.5543 17.6686 12.4731 0.0851 0.0945 0.2951 5.2848 0.1764 224.6425 1.5437 5.9003 8.0930 104.8375 13.7564 101.3984 3.7604 0.8805 27.8335 39.2264 3.5692 8.4203 48.0853 27.4483 14.5778 35.8860 67.1810 8.2244 181.1578 1.9417 41.1170 4.9029 12.7653 396.5533 90.2562 19.1321 34.5032 33.0684 6.5710 24.5702 1.0223 12.4526 30.1428 7.5105 16.6965 30.4057 4.4856 12.9473 133.4021 38.4478
temp: 298.150 k
press: 1.00000 atm
elementType: 16 8 8 8 8 7 7 6 6 6 6 6 6 6 6 6 6 6 6 6 6 1 1 1 1 1 1 1 1 1 1 1 1 1 1 1 1
symmnumber: 1
zpe: 735981.6 jmol-1
zpe.correction: 0.280321 hartree
zpe.thermalcorrener: 0.301895 hartree
zpe.thermalcorrenthalpy: 0.302839 hartree
zpe.thermalcorrgfe: 0.228568 hartree
zpe.sumelectzpe: -1349.801828 hartree
zpe.sumelectthermal: -1349.780253 hartree
zpe.sumelectthermalent: -1349.779309 hartree
zpe.sumelectthermalfe: -1349.853580 hartree
dipole: 5.6502 -1.3059 -7.7349
dipole: 9.6674
quadrupole: -119.1208 -112.7922 -134.6983
quadrupole: 2.3501 0.0124 -18.6151
quadrupole: 3.0830 9.4116 -12.4945 2.3501 0.0124 -18.6151
hfenergy: -1350.0821482 hartree
pointgroup: C01 [X(C14H16N2O4S1)]
dipole: -2.1406932 -1.5832361 2.7160673 debye
polarizability: 238.41704|-4.2955686|220.9858393|-4.3851806|1.5643146|204.1088297 unknown
InChI: InChI=1S/C14H16N2O4S/c1-19-12-9-14(13(20-2)8-11(12)15)21(17,18)16-10-6-4-3-5-7-10/h3-9,16H,15H2,1-2H3
charge 0 multiplicity 1
37 atoms
S  0.563666 1.265041 -1.484817
O  -0.764877 2.17154 1.06985
O  -2.873585 -2.722968 -0.77097
O  0.094522 2.735568 -1.974776
O  1.100245 0.169061 -2.562416
N  2.023432 1.608185 -0.221546
N  -3.996785 -1.567393 1.342939
C  -0.790134 0.387433 -0.52791
C  -1.360556 0.983844 0.616074
C  -1.242905 -0.849388 -1.029014
C  -2.308714 -1.490987 -0.387823
C  -2.936208 -0.896958 0.758731
C  -2.443114 0.338242 1.255316
C  2.556596 0.448157 0.40616
C  3.316213 -0.469145 -0.374876
C  2.393768 0.217021 1.802696
C  3.908428 -1.58864 0.242448
C  3.022309 -0.887271 2.415093
C  3.774682 -1.79931 1.637443
C  -1.506052 2.984173 2.041011
C  -2.274002 -3.395559 -1.92686
H  -0.740367 -1.262822 -1.909205
H  1.556676 2.259348 0.440012
H  -2.905467 0.775208 2.145995
H  3.432986 -0.281176 -1.44581
H  1.786681 0.911959 2.396892
H  -4.291399 -2.453678 0.939553
H  -4.482561 -1.193477 2.151825
H  4.491635 -2.291624 -0.362775
H  2.913738 -1.045128 3.494147
H  4.25349 -2.66255 2.112637
H  -1.560347 2.480646 3.025437
H  -2.523944 3.206033 1.670733
H  -0.931429 3.917156 2.132483
H  -2.369285 -2.77593 -2.838777
H  -2.841465 -4.329606 -2.048695
H  -1.207072 -3.623306 -1.741704
