program: Gaussian 09
title: 000104091
version: EM64L-G09RevD.01
frameworkgroup: C1[X(C7H4N2O6)]
method: RPBEPBE
basis: SDD
operation: Freq
keyword: #pfreq=noraman
keyword: PBEPBE/SDD
title: #p freq=noraman PBEPBE/SDD
converged: NO YES NO NO
title: Mulliken charges:
elementType: O O O O O O N N C C C C C C C H H H H
charge: -0.306118 -0.145311 -0.203052 -0.246243 -0.145769 -0.182832 0.031534 0.022070 0.330318 0.335067 0.052439 0.496227 -0.529066 -0.520483 -0.196024 0.330796 0.306697 0.188753 0.380995
chargesum: 0.00000
title: Mulliken charges with hydrogens summed into heavy atoms:
elementType: O O O O O O N N C C C C C C C
charge: 0.074877 -0.145311 -0.203052 -0.246243 -0.145769 -0.182832 0.031534 0.022070 0.330318 0.335067 0.052439 0.496227 -0.198270 -0.213786 -0.007271
polarizability: 1.65272223e+02 3.23165983e+00 1.67388124e+02 3.09781309e-02 -6.98928909e-02 4.17050844e+01
1716.lowfreq: -37.4611 -7.3548 -5.9915 -0.0006 -0.0005 -0.0001 5.4139 57.2922 92.3858
frequency: -37.4607 57.2898 92.3854 112.2768 140.0019 168.2660 187.5501 225.9344 305.5952 331.9890 348.5508 362.9821 381.0006 424.7830 449.7033 455.6803 559.7664 595.1076 659.5895 666.8657 691.4822 704.2254 743.9684 748.4623 792.9134 854.6575 903.6848 932.7348 948.5699 985.7176 1010.9493 1077.4356 1126.3557 1164.7136 1180.6932 1220.7397 1280.7842 1306.1719 1352.6725 1375.6722 1389.2190 1420.8693 1446.0026 1494.3939 1575.6138 1604.0457 1634.6664 2798.7404 2902.9342 3153.6952 3163.8898
redmass: 15.1633 12.4865 9.9638 11.1799 10.5317 3.7635 13.7788 4.1055 10.1450 13.0674 4.8359 11.8092 6.8872 7.2854 5.1806 13.9259 3.7197 7.0154 7.3182 7.9330 9.7561 9.8544 6.9355 10.8455 5.5705 10.3954 1.0644 1.4773 6.6533 1.3635 1.8045 2.0930 5.5867 2.0729 6.5078 3.9296 2.8914 2.6751 3.1889 7.6802 1.6745 4.5472 3.8927 4.3885 4.2276 7.6040 7.5260 1.0678 1.0866 1.0916 1.0924
irintensity: 0.0084 0.3741 13.3176 2.7253 5.9395 0.3466 3.6717 3.5264 4.5226 1.7167 3.8151 2.9150 14.2066 3.3113 0.0022 0.0586 16.8521 11.7338 0.1553 24.8260 50.4847 0.0075 15.9095 4.1924 2.2550 44.1564 131.8141 16.5774 17.8105 0.2819 24.6419 50.3074 305.8517 20.3454 261.4444 37.2233 132.3685 81.0431 108.6000 38.3365 35.8927 27.4403 163.7746 11.1638 68.6074 333.6751 78.4826 336.7505 81.1305 7.4709 15.3297
temp: 298.150 k
press: 1.00000 atm
elementType: 8 8 8 8 8 8 7 7 6 6 6 6 6 6 6 1 1 1 1
symmnumber: 1
zpe: 296147.5 jmol-1
zpe.correction: 0.112797 hartree
zpe.thermalcorrener: 0.124490 hartree
zpe.thermalcorrenthalpy: 0.125434 hartree
zpe.thermalcorrgfe: 0.074241 hartree
zpe.sumelectzpe: -828.729327 hartree
zpe.sumelectthermal: -828.717633 hartree
zpe.sumelectthermalent: -828.716689 hartree
zpe.sumelectthermalfe: -828.767882 hartree
dipole: 0.6568 1.2599 0.0029
dipole: 1.4208
quadrupole: -114.3972 -91.6590 -81.7208
quadrupole: -5.9378 0.0106 0.0343
quadrupole: -18.4715 4.2667 14.2048 -5.9378 0.0106 0.0343
hfenergy: -828.8421236 hartree
pointgroup: C01 [X(C7H4N2O6)]
dipole: -0.3223528 -0.4565667 0.010535 debye
dipolederiv: -0.4620761 -0.1977039 0.0050478 -0.2427365 -1.1172515 0.0171295 0.0055384 0.0178251 -0.3115887 -0.8946379 0.2563235 -0.0013318 0.0785363 -0.3969015 0.0036218 0.0011817 0.0030098 -0.1810718 -0.6828441 0.2133041 -0.0010865 0.2056895 -0.6744364 0.0033649 -0.0014722 0.0042256 -0.2262067 -0.5253053 -0.1334479 0.0034918 -0.0576821 -0.8585359 0.0110461 0.0023141 0.0116921 -0.2569098 -0.6585539 -0.1784542 0.0032206 -0.1087841 -0.4893448 0.0023941 0.0031578 0.0028878 -0.1831838 -0.8912995 -0.5764958 0.0134026 -0.1831024 -0.5950132 0.0058216 0.0051046 0.0069759 -0.312487 1.3571694 -0.4672633 0.0036815 -0.4024191 1.5279919 -0.0217419 0.0031741 -0.0217776 0.2146757 1.7645631 -0.1689307 -0.0019824 -0.1433804 1.0030414 -0.0053834 -0.0026828 -0.0073691 0.1852016 -0.4196537 -0.0602213 0.0034887 0.4259667 -0.8048809 0.0130248 -0.0051618 0.0159088 0.0282882 -0.5711332 0.1832511 -0.0010715 -0.3333621 -0.4019196 0.0091863 0.0077392 0.0067381 0.0429545 0.4354343 0.1784491 -0.0056289 0.2568206 0.9919262 -0.0190016 -0.0080361 -0.0187753 0.1513333 -0.7178009 0.1225072 0.0013596 -0.0211576 -0.9085238 0.0159814 0.0042678 0.0155622 0.0028782 -0.0550444 0.0305131 -0.0008234 -0.3891344 0.6650457 -0.010381 0.0069466 -0.0120925 -0.0191144 0.5868983 -0.0047485 -0.0036937 0.4039459 0.0366396 -0.004113 -0.0092109 -0.0016244 -0.0688534 0.9967497 0.5911995 -0.0151414 0.4758453 1.3956196 -0.0239158 -0.0123402 -0.0239144 0.1169693 0.1278086 0.0164926 0.0000239 0.0172673 0.1554899 0.000112 -0.0001956 -0.0002291 0.1657775 0.1764255 0.0303341 -0.0005357 0.0289842 0.0914593 0.0012933 -0.0010136 0.0009755 0.1648013 -0.0670832 0.2012871 -0.002386 0.0536745 -0.1277251 0.0037327 0.0002719 0.0023647 0.1169145 0.5003835 -0.0363957 -0.0000353 -0.0649717 0.5073191 -0.0021717 0.000417 -0.0023831 0.3696215 unknown
polarizability: 166.1639358|3.3864756|166.4574295|-0.6148013|-2.1349348|41.744066 unknown
InChI: InChI=1S/C7H4N2O6/c10-3-4-1-5(8(12)13)7(11)6(2-4)9(14)15/h1-3,11H
charge 0 multiplicity 1
19 atoms
O  1.251456 2.085785 -0.073993
O  -2.925734 2.007363 -0.0499
O  3.284072 -1.630146 -0.018885
O  -1.000345 3.217966 -0.079817
O  3.47074 0.640289 -0.043539
O  -2.797331 -3.015952 0.037695
N  -1.651887 2.066741 -0.055855
N  2.777356 -0.438047 -0.030165
C  -0.857944 0.830249 -0.036483
C  1.286877 -0.350075 -0.027147
C  0.591746 0.905967 -0.046477
C  -0.829992 -1.601212 0.00617
C  -1.551383 -0.389529 -0.010732
C  0.585059 -1.566271 -0.002237
C  -1.545591 -2.907406 0.032295
H  -2.646551 -0.405732 -0.004065
H  1.173764 -2.490368 0.011131
H  -0.883361 -3.807655 0.041602
H  0.539247 2.838032 -0.083499
