program: Gaussian 09
title: 000104105
version: EM64L-G09RevD.01
frameworkgroup: C1[X(C13H6Br6O2)]
method: RPBEPBE
basis: SDD
operation: Freq
keyword: #p
keyword: freq=noraman
keyword: PBEPBE/SDD
title: #p freq=noraman PBEPBE/SDD
converged: YES YES NO NO
title: Mulliken charges:
elementType: Br Br Br Br Br Br O O C C C C C C C C C C C C C H H H H H H
charge: 0.080980 0.081187 0.081240 0.081060 0.050798 0.050798 -0.237048 -0.237037 0.535475 0.535488 -0.173345 -0.348962 -0.348684 -0.348663 -0.348951 -0.141187 -0.141195 -0.141192 -0.141188 -0.239871 -0.239870 0.238750 0.238710 0.278177 0.278172 0.278176 0.278182
chargesum: 0.00000
title: Mulliken charges with hydrogens summed into heavy atoms:
elementType: Br Br Br Br Br Br O O C C C C C C C C C C C C C
charge: 0.080980 0.081187 0.081240 0.081060 0.050798 0.050798 -0.237048 -0.237037 0.535475 0.535488 0.304116 -0.348962 -0.348684 -0.348663 -0.348951 0.136990 0.136977 0.136984 0.136994 -0.239871 -0.239870
polarizability: 3.56843482e+02 6.94022057e-02 2.87696292e+02 1.95011566e-04 -1.33875403e-02 1.15836840e+02
1716.lowfreq: -8.4876 -4.0136 -0.0004 -0.0002 -0.0001 3.1733 3.3863 14.1354 14.2862
frequency: -8.4834 14.1119 14.2855 22.3272 27.8544 62.8300 100.2528 102.1112 102.7248 110.2751 112.3227 117.2059 124.0520 164.4419 176.7233 179.3325 200.9805 217.9588 221.7088 222.1119 227.4517 294.3920 347.5446 348.1531 348.5051 401.2162 411.0345 499.7998 500.2096 510.9142 516.8524 557.0978 567.1673 621.9017 682.8219 706.5819 710.6890 723.0966 733.9586 791.0189 839.7746 864.5102 864.6845 874.6452 874.6693 964.0697 988.3198 1024.3947 1043.7646 1065.0280 1094.6102 1094.8784 1182.9876 1183.8949 1197.2662 1205.1525 1237.2279 1329.5794 1330.4575 1357.5063 1357.9498 1374.9819 1407.4777 1429.8431 1475.1016 1533.7489 1535.6151 1556.3432 1557.0882 2949.1880 3020.6973 3185.7261 3185.7285 3187.6667 3187.7041
redmass: 41.6522 31.5713 43.9751 31.0565 55.3630 35.0039 2.4420 18.8211 11.9103 41.8812 17.5842 41.9096 10.8458 14.7506 4.7284 4.5314 6.8636 11.6580 73.5497 73.6260 14.0834 13.5508 8.8545 7.9596 7.9077 9.7931 8.6184 4.9743 4.9744 7.0808 7.2391 4.0536 3.6841 10.9673 9.1247 10.2036 10.2469 7.6185 7.3709 7.5077 7.9210 1.4346 1.4385 1.3689 1.3688 9.4313 8.4426 6.1956 5.4486 1.4372 2.3995 2.4274 1.6027 1.6076 1.0501 3.2572 3.4767 4.7920 4.9414 4.2000 4.1616 1.6186 3.2074 1.8497 1.0976 9.5659 9.5387 7.5301 7.5755 1.0500 1.1151 1.0931 1.0931 1.0938 1.0938
irintensity: 0.0000 0.0052 0.0141 0.0000 0.0269 0.0306 7.9364 0.1838 0.2197 0.0000 0.6131 0.1443 0.0198 0.1010 0.0000 0.0346 1.9888 0.0001 0.1561 0.0009 1.5419 4.6765 2.9921 0.0001 8.9776 3.6970 0.7759 0.0000 0.0366 0.0001 11.7626 24.8183 2.1403 58.1623 3.2962 0.0012 108.0984 29.7589 0.0460 73.1052 0.0378 8.4486 49.0748 0.0001 0.0235 459.3765 20.3019 59.4201 5.8200 4.2535 18.3481 2.8833 0.0007 19.0810 0.1062 309.1592 0.1756 0.0046 30.7888 0.0004 55.4306 311.1859 31.1709 170.1088 0.2889 0.0063 116.3911 26.5040 86.8224 31.5453 14.6454 0.1149 1.3980 0.5023 0.0824
temp: 298.150 k
press: 1.00000 atm
elementType: 35 35 35 35 35 35 8 8 6 6 6 6 6 6 6 6 6 6 6 6 6 1 1 1 1 1 1
symmnumber: 1
zpe: 396898.8 jmol-1
zpe.correction: 0.151171 hartree
zpe.thermalcorrener: 0.172737 hartree
zpe.thermalcorrenthalpy: 0.173681 hartree
zpe.thermalcorrgfe: 0.093123 hartree
zpe.sumelectzpe: -728.635040 hartree
zpe.sumelectthermal: -728.613474 hartree
zpe.sumelectthermalent: -728.612530 hartree
zpe.sumelectthermalfe: -728.693088 hartree
dipole: 0.0004 -0.0031 2.9600
dipole: 2.9600
quadrupole: -169.8926 -167.9657 -184.9170
quadrupole: 0.0077 0.0001 0.0229
quadrupole: 4.3658 6.2927 -10.6586 0.0077 0.0001 0.0229
hfenergy: -728.786211 hartree
pointgroup: C01[X(C13H6Br6O2)]
dipole: 0.0001085 0.0137945 1.1644875 debye
polarizability: 356.8434578|0.0806631|287.6673459|0.0073686|-2.2311832|115.865811 unknown
InChI: InChI=1S/C13H6Br6O2/c14-6-1-8(16)12(9(17)2-6)20-5-21-13-10(18)3-7(15)4-11(13)19/h1-4H,5H2
charge 0 multiplicity 1
27 atoms
Br -2.208273 2.905585 -0.556611
Br 2.197598 -2.916753 -0.486115
Br -2.197592 -2.91587 -0.492212
Br 2.208538 2.904532 -0.562538
Br -6.825233 0.007941 1.40497
Br 6.8252 0.010781 1.405482
O  -1.140278 -0.009247 -1.031102
O  1.140452 -0.011226 -1.031055
C  -2.396169 -0.004279 -0.406526
C  2.396335 -0.005004 -0.406404
C  0.0001 0.001986 -0.117293
C  -3.080896 1.212923 -0.145168
C  3.076724 -1.217931 -0.115936
C  -3.076645 -1.217769 -0.118583
C  3.081057 1.212719 -0.147489
C  -4.386196 1.233341 0.387372
C  4.381875 -1.230226 0.417201
C  -4.381846 -1.231109 0.414416
C  4.386309 1.234165 0.385137
C  -5.016118 0.002892 0.663635
C  5.016158 0.00426 0.663963
H  0.000875 0.930272 0.489846
H  -0.000683 -0.910093 0.513855
H  -4.893666 2.181828 0.575312
H  4.885906 -2.175719 0.628114
H  -4.885926 -2.177014 0.623346
H  4.893793 2.183016 0.571183
