program: Gaussian 09
title: 000104104
version: EM64L-G09RevD.01
frameworkgroup: C1[X(C12H8N2O5S)]
method: RPBEPBE
basis: SDD
operation: Freq
keyword: #p
keyword: freq=noraman
keyword: PBEPBE/SDD
title: #p freq=noraman PBEPBE/SDD
converged: NO YES NO NO
title: Mulliken charges:
elementType: S O O O O O N N C C C C C C C C C C C C H H H H H H H H
charge: 0.985110 -0.555597 -0.229824 -0.231933 -0.475197 -0.527929 -0.392788 -0.665890 0.184442 0.379312 0.180066 0.158856 0.419303 -0.413649 -0.421928 -0.385779 0.049591 -0.361745 0.053128 -0.260260 0.315555 0.211884 0.285257 0.245449 0.357950 0.327471 0.381855 0.387291
chargesum: 0.00000
title: Mulliken charges with hydrogens summed into heavy atoms:
elementType: S O O O O O N N C C C C C C C C C C C C
charge: 0.985110 -0.168306 -0.229824 -0.231933 -0.475197 -0.527929 -0.034838 0.043435 0.184442 0.379312 0.180066 0.158856 0.419303 -0.413649 -0.106373 -0.173895 0.049591 -0.076488 0.053128 -0.014810
polarizability: 2.90094875e+02 -2.77925216e+00 2.30741929e+02 -2.21477775e+00 8.15067235e-01 8.84512741e+01
1716.lowfreq: -5.1924 -0.0013 0.0007 0.0010 5.0121 6.0592 34.6888 49.9410 76.6357
frequency: 34.6521 49.9395 76.6328 106.0728 130.0211 154.9465 173.5934 181.6726 186.5219 224.9074 239.5129 259.6350 289.3256 313.0044 325.6568 350.4767 364.5765 373.4341 392.4611 412.5951 441.6658 457.4908 466.9184 505.7554 516.2672 540.5964 557.1361 586.3120 607.6147 639.4528 665.7770 702.6304 722.2428 746.5641 752.8701 777.3961 791.3948 802.1191 807.1510 815.0328 882.3398 890.4970 944.2642 947.9014 965.7168 984.5340 1004.4544 1048.6446 1054.5888 1088.2110 1155.4735 1177.7728 1198.8520 1228.3993 1248.5225 1290.1192 1344.3753 1363.9290 1379.3652 1395.8915 1420.5045 1456.3194 1471.1488 1535.3417 1561.7753 1591.6672 1604.7990 1623.1065 1634.3312 1659.8600 3132.6846 3144.6146 3155.5275 3173.2326 3311.5320 3474.7741 3501.5106 3647.8021
redmass: 8.0071 10.6113 5.3605 5.9280 9.4138 9.4079 3.3683 2.9397 4.1645 9.3777 3.3276 5.3807 4.0935 8.7930 7.8053 10.3066 4.6943 6.3096 9.9639 8.4661 2.0898 9.3280 2.0572 6.5511 3.9743 7.5012 7.8781 3.5383 5.5565 5.9642 3.4573 7.0605 3.8346 4.0956 2.4320 1.4205 1.6512 2.3717 4.2382 6.7527 6.1422 4.5328 1.4512 8.3224 1.6196 3.7017 1.3837 1.3654 1.8929 2.2717 3.4637 1.4190 1.8445 1.8011 2.4669 3.2492 4.7393 1.7619 3.8180 4.1653 7.4841 2.7533 5.2623 5.8102 5.2823 7.9662 6.6242 7.0767 5.3247 1.3253 1.0874 1.0922 1.0910 1.0987 1.0650 1.0661 1.0765 1.0869
irintensity: 1.3737 0.6132 0.6224 2.5957 0.5498 6.5621 16.1291 15.2378 7.5848 6.6343 24.5437 10.3625 42.4990 7.1012 27.6229 8.8272 3.2969 3.9497 53.1360 50.5604 19.3781 12.3031 31.6191 50.5528 71.9861 3.9406 93.8297 0.5678 39.5117 13.9480 5.9165 5.4001 11.6652 2.2385 5.4901 41.6632 187.4861 105.8052 0.6409 109.1502 13.9729 7.5963 3.2380 65.2619 6.1660 7.5857 1.6661 58.8097 35.9946 38.6836 6.7838 1.3458 7.5170 75.9980 150.0932 48.3272 169.3745 0.5532 50.0209 2.0673 15.4627 20.5685 21.4061 101.0236 44.2754 461.9678 21.0330 121.3443 315.0260 295.8735 5.5871 13.5518 4.9370 12.1125 276.7991 53.5140 66.5327 60.5487
temp: 298.150 k
press: 1.00000 atm
elementType: 16 8 8 8 8 8 7 7 6 6 6 6 6 6 6 6 6 6 6 6 1 1 1 1 1 1 1 1
symmnumber: 1
zpe: 491883.0 jmol-1
zpe.correction: 0.187348 hartree
zpe.thermalcorrener: 0.204415 hartree
zpe.thermalcorrenthalpy: 0.205359 hartree
zpe.thermalcorrgfe: 0.142722 hartree
zpe.sumelectzpe: -1344.253731 hartree
zpe.sumelectthermal: -1344.236665 hartree
zpe.sumelectthermalent: -1344.235721 hartree
zpe.sumelectthermalfe: -1344.298358 hartree
dipole: 0.3973 6.7912 1.2467
dipole: 6.9161
quadrupole: -138.5055 -113.6871 -125.9440
quadrupole: -2.1856 9.5166 -3.1609
quadrupole: -12.4600 12.3585 0.1015 -2.1856 9.5166 -3.1609
hfenergy: -1344.4410797 hartree
pointgroup: C01 [X(C12H8N2O5S1)]
dipole: 0.2269229 -2.6842782 -0.3834475 debye
polarizability: 289.9077971|4.4760536|230.7780618|-0.6384513|-5.0401691|88.6022192 unknown
InChI: InChI=1S/C12H8N2O5S/c13-10-5-2-1-3-6-9(5)7(12(16)14-11(6)15)4-8(10)20(17,18)19/h1-4,14,17H,13H2
charge 0 multiplicity 1
28 atoms
S  3.601647 0.502937 0.001333
O  3.764921 0.57784 -1.84551
O  -0.955852 3.39683 -0.080871
O  -4.600509 0.514183 -0.080174
O  3.902984 1.969915 0.59891
O  4.47763 -0.774064 0.523917
N  -2.732369 1.896697 -0.077546
N  2.213275 -2.309605 0.150825
C  -0.985052 -0.319081 0.009529
C  -0.10523 -1.459835 0.061535
C  -0.453159 1.016186 -0.012528
C  -2.403049 -0.53303 -0.009821
C  1.344845 -1.255425 0.080082
C  1.790651 0.098227 0.045674
C  0.93018 1.210956 -0.004198
C  -0.678393 -2.767653 0.089349
C  -1.347971 2.19526 -0.058499
C  -2.934625 -1.831092 0.016381
C  -3.34098 0.626864 -0.057829
C  -2.068026 -2.952863 0.065974
H  1.32618 2.233039 -0.021975
H  -0.044168 -3.660224 0.129368
H  -4.023123 -1.94733 -0.000965
H  -2.483573 -3.964738 0.087524
H  -3.365966 2.704297 -0.109859
H  1.877236 -3.268022 0.167066
H  3.223936 -2.123259 0.254924
H  4.671262 0.95019 -2.055316
