program: Gaussian 09
title: 000104087
version: EM64L-G09RevD.01
frameworkgroup: C1[X(C8H5ClN2O5)]
method: RPBEPBE
basis: SDD
operation: Freq
keyword: #p
keyword: freq=noraman
keyword: PBEPBE/SDD
title: #p freq=noraman PBEPBE/SDD
converged: YES YES NO NO
title: Mulliken charges:
elementType: Cl O O O O O N N C C C C C C C C H H H H H
charge: 0.159720 -0.193384 -0.181406 -0.195202 -0.160229 -0.156288 0.021225 0.017747 0.417525 0.538772 0.544445 -0.518755 -0.540104 -0.536721 0.134659 -0.779196 0.312972 0.344483 0.247664 0.247677 0.274393
chargesum: 0.00000
title: Mulliken charges with hydrogens summed into heavy atoms:
elementType: Cl O O O O O N N C C C C C C C C
charge: 0.159720 -0.193384 -0.181406 -0.195202 -0.160229 -0.156288 0.021225 0.017747 0.417525 0.538772 0.544445 -0.205782 -0.195621 -0.536721 0.134659 -0.009461
polarizability: 1.92728146e+02 -3.57174658e+00 1.65745065e+02 -4.24178670e-02 2.54533708e-02 5.25818257e+01
1716.lowfreq: -67.7976 -59.3962 -2.0171 -0.0019 -0.0017 -0.0011 2.2732 3.1111 40.6571
frequency: -67.7949 -59.3917 40.6522 50.7885 109.1414 131.7807 162.0639 186.7600 193.5694 262.3962 285.3288 286.8633 302.2631 314.8578 347.1078 396.4415 460.3534 484.2616 492.7247 548.8305 607.8109 616.2512 627.8105 682.3325 683.4467 709.2287 732.7542 742.6902 827.5819 853.6969 960.9195 964.4203 998.7299 1030.2810 1035.1594 1103.1603 1109.0336 1172.7236 1179.1494 1181.8588 1255.5393 1347.9440 1367.4005 1376.4363 1384.1309 1417.5312 1443.4988 1449.0856 1461.4756 1554.5420 1595.3477 1620.7873 2986.1704 3067.4120 3133.7550 3171.6022 3184.0575
redmass: 16.8808 15.9875 18.3738 4.5192 7.4659 6.2299 1.0590 4.2356 13.6352 21.8038 9.3393 8.2104 6.7095 13.1963 8.9735 15.2463 5.6849 4.9598 3.6882 6.7864 5.0441 6.1901 5.1813 3.6566 11.0815 9.3315 12.5279 5.7484 12.0285 8.9700 1.5070 1.9915 1.3867 6.9450 1.8622 2.8730 2.0463 6.8829 2.0026 13.4057 3.6824 3.2483 9.1689 1.7701 2.8251 8.3092 2.6892 1.3711 1.0482 8.6550 7.4602 8.4839 1.0388 1.0965 1.0987 1.0912 1.0912
irintensity: 0.0008 0.0138 0.9688 6.3626 5.7627 3.5576 0.3218 0.4612 3.0823 0.2793 0.3991 0.0226 1.7135 0.8452 1.2507 1.2160 0.0823 3.5300 3.7658 35.1424 14.3945 3.1380 0.7849 0.3761 39.7968 0.0115 1.7050 5.2629 64.4119 10.0111 31.5711 26.5064 7.7238 49.5186 0.2564 36.6508 1.6058 441.7818 4.3030 33.9840 216.0539 1.2915 3.2186 24.7864 115.9814 22.5361 128.0900 3.0048 24.2394 34.9384 100.7354 80.3500 2.5122 7.1936 10.7395 24.9869 8.1311
temp: 298.150 k
press: 1.00000 atm
elementType: 17 8 8 8 8 8 7 7 6 6 6 6 6 6 6 6 1 1 1 1 1
symmnumber: 1
zpe: 333111.8 jmol-1
zpe.correction: 0.126876 hartree
zpe.thermalcorrener: 0.139822 hartree
zpe.thermalcorrenthalpy: 0.140766 hartree
zpe.thermalcorrgfe: 0.086163 hartree
zpe.sumelectzpe: -1252.183109 hartree
zpe.sumelectthermal: -1252.170162 hartree
zpe.sumelectthermalent: -1252.169218 hartree
zpe.sumelectthermalfe: -1252.223821 hartree
dipole: 3.0820 2.2304 -0.0026
dipole: 3.8044
quadrupole: -101.2503 -124.7217 -94.0268
quadrupole: 9.1875 0.0298 -0.0022
quadrupole: 5.4160 -18.0554 12.6394 9.1875 0.0298 -0.0022
hfenergy: -1252.3099843 hartree
pointgroup: C01 [X(C8H5Cl1N2O5)]
dipole: -1.219076 0.8684253 0.0008321 debye
dipolederiv: -0.565761 -0.058664 -0.0008818 -0.0703458 0.0548987 0.0000689 -0.0011541 -0.0000022 0.0758217 -0.8507349 -0.1341551 -0.0001916 -0.2636092 -0.688403 -0.0001607 -0.0000879 0.0000133 -0.2925483 -0.473228 -0.0145184 0.0020223 -0.0943007 -0.8130505 0.0021217 0.0011679 0.0007231 -0.206537 -0.5367036 0.1075401 -0.000125 0.1665537 -0.7946575 0.0000963 -0.0001477 0.0000913 -0.2139932 -0.6627857 0.0966578 0.0023284 0.1524916 -0.4969501 0.0000626 0.0026007 0.0005401 -0.1859222 -0.6098875 -0.1454936 -0.0001786 -0.1783592 -0.5486387 -0.0000171 -0.0000607 -0.0000037 -0.1824386 1.0656803 -0.3224861 -0.0053887 -0.2073729 1.5686777 -0.0023013 -0.003862 -0.0018891 0.182009 0.990268 0.2076428 0.0002858 0.0761875 1.6873541 -0.0001014 0.0001969 -0.0000451 0.18074 -0.5973056 0.0373252 -0.0002191 0.082625 -0.4474624 0.0000281 -0.0004126 0.0001144 0.0091456 -0.4266266 0.0902586 0.0004381 -0.0161088 -0.4892226 -0.0001311 0.0000609 0.000227 0.1133861 -0.4381284 -0.1156827 -0.0004684 0.0487175 -0.5694553 0.0000879 -0.0005182 -0.0000785 0.1198886 0.12604 0.2673842 0.0001172 0.109274 0.096356 0.000017 0.000142 0.0000343 -0.0840929 0.1418065 -0.2117237 0.0002256 -0.1340684 0.0441712 -0.0001834 -0.0004449 0.0008068 -0.0465724 0.9396768 0.0557458 0.0017362 0.0570022 0.3812716 0.0003187 0.0017433 -0.0001713 -0.0666374 1.7292237 0.0075475 0.0005488 0.0026668 0.8155339 0.0000327 0.000518 -0.0001513 0.1272156 -0.2889918 0.1787167 -0.0000931 0.3148645 -0.3203329 0.0000882 -0.0000745 0.0000431 0.0390006 0.1396554 0.0414573 -0.0000387 0.0793543 0.1442882 0.0000324 0.0000576 0.00001 0.1509886 0.2011446 -0.028283 -0.000107 -0.0000293 0.1658826 -0.0000466 0.0003019 -0.0002809 0.1627178 0.0963246 -0.0230873 0.0786294 -0.0232855 0.0611552 0.0692723 0.0566454 0.0764292 -0.005567 0.0963925 -0.0230771 -0.0785841 -0.0232919 0.0611701 -0.0692685 -0.0566231 -0.0764234 -0.005606 -0.0760595 -0.013105 -0.0000557 -0.0789655 0.0874139 -0.0000166 -0.0000491 0.0000131 0.1290014 unknown
polarizability: 192.6731773|3.7733212|165.8000488|-0.010691|-0.016716|52.5818108 unknown
InChI: InChI=1S/C8H5ClN2O5/c1-4(12)5-2-6(10(13)14)8(9)7(3-5)11(15)16/h2-3H,1H3
charge 0 multiplicity 1
21 atoms
Cl 3.10815 0.327318 0.002744
O  -3.49036 -1.556467 -0.000762
O  0.752178 -3.539049 0.004353
O  -0.011886 3.605025 -0.000043
O  2.748143 -2.460802 -0.006599
O  2.167854 2.977194 0.00079
N  1.467334 -2.465451 0.000441
N  0.917151 2.70525 0.000448
C  -1.535192 -0.165602 -0.000363
C  0.708692 -1.154493 0.000503
C  0.454742 1.266436 0.000299
C  -0.947806 1.112541 -0.00036
C  -0.690362 -1.295609 0.000106
C  1.32893 0.13618 0.000751
C  -3.034606 -0.380533 -0.000931
C  -3.945104 0.835031 -0.001173
H  -1.546148 2.026751 -0.000812
H  -1.129421 -2.29786 0.000107
H  -3.767302 1.466844 -0.891837
H  -3.767684 1.466913 0.88952
H  -4.993104 0.502183 -0.001381
