program: Gaussian 09
title: 000104086
version: EM64L-G09RevD.01
frameworkgroup: C1[X(C8H6N2O6)]
method: RPBEPBE
basis: SDD
operation: Freq
keyword: #pfreq=noraman
keyword: PBEPBE/SDD
title: #p freq=noraman PBEPBE/SDD
converged: YES YES NO NO
title: Mulliken charges:
elementType: O O O O O O N N C C C C C C C C H H H H H H
charge: -0.306466 -0.197612 -0.162917 -0.193057 -0.248470 -0.149852 0.026024 0.022931 0.415338 0.326200 0.322036 0.036875 -0.514214 -0.517931 0.129173 -0.780478 0.304430 0.343893 0.244736 0.244735 0.274623 0.380001
chargesum: 0.00000
title: Mulliken charges with hydrogens summed into heavy atoms:
elementType: O O O O O O N N C C C C C C C C
charge: 0.073535 -0.197612 -0.162917 -0.193057 -0.248470 -0.149852 0.026024 0.022931 0.415338 0.326200 0.322036 0.036875 -0.209784 -0.174037 0.129173 -0.016383
polarizability: 1.79572618e+02 6.39142953e+00 1.76644884e+02 5.77254197e-02 5.86684696e-02 5.13758164e+01
1716.lowfreq: -44.6605 -4.8980 -4.2097 -0.0003 0.0005 0.0006 6.9491 50.9471 59.5649
frequency: -44.6553 50.9428 59.5602 102.5542 119.9553 132.2324 149.9380 185.0149 200.2445 301.9014 306.1608 310.0079 329.3676 370.9544 380.3485 445.5020 455.9922 482.9950 510.3260 565.2523 611.4509 646.7793 678.2746 688.1489 703.3036 710.0010 737.5921 768.2091 852.9480 881.4756 895.6158 944.6698 962.9360 1000.8760 1033.4592 1078.9498 1105.4215 1139.2131 1166.4852 1185.6254 1262.6623 1285.7614 1303.1167 1356.9510 1373.5536 1377.5525 1416.2529 1444.8252 1446.5764 1462.4162 1496.6302 1563.2835 1609.6134 1622.8639 2816.7931 2985.2285 3068.1413 3130.5480 3165.3998 3179.9870
redmass: 15.2731 4.7526 10.3508 11.2981 7.9513 6.3123 1.0408 11.9424 4.8634 5.1644 7.9509 7.9341 11.8748 12.4899 6.4407 5.3396 13.2021 4.6867 3.3322 5.1462 4.8101 5.3863 3.8839 9.9161 9.3851 9.1604 8.0843 8.1013 9.6983 7.7815 1.0654 1.4605 1.9814 1.3927 1.8321 1.8059 5.2564 4.7332 2.0090 11.6160 3.0766 4.3298 2.2171 4.9599 2.1493 2.4139 4.7108 3.9030 1.1162 1.0486 4.3115 4.2781 7.5906 7.6960 1.0677 1.0383 1.0968 1.0987 1.0914 1.0917
irintensity: 0.0002 4.7191 1.7122 3.6810 2.3233 2.9835 0.3526 5.3394 0.0516 0.7880 0.3154 0.4064 0.5259 1.6123 17.0038 0.4401 0.0246 1.1196 2.1297 41.2988 11.7529 1.3598 1.3586 41.7915 0.1160 3.4134 14.9985 4.1330 38.0216 1.5523 129.7741 31.9910 18.3989 8.5424 0.0490 42.9905 24.3612 335.7391 5.3409 267.7859 85.2520 230.2981 117.0632 150.7296 5.5018 92.2946 43.2220 26.7624 34.9765 23.8729 44.8406 94.3964 230.4202 47.9041 281.9631 2.5067 8.4256 10.4452 21.9001 4.5593
temp: 298.150 k
press: 1.00000 atm
elementType: 8 8 8 8 8 8 7 7 6 6 6 6 6 6 6 6 1 1 1 1 1 1
symmnumber: 1
zpe: 368562.5 jmol-1
zpe.correction: 0.140378 hartree
zpe.thermalcorrener: 0.153680 hartree
zpe.thermalcorrenthalpy: 0.154624 hartree
zpe.thermalcorrgfe: 0.099696 hartree
zpe.sumelectzpe: -867.965849 hartree
zpe.sumelectthermal: -867.952548 hartree
zpe.sumelectthermalent: -867.951604 hartree
zpe.sumelectthermalfe: -868.006532 hartree
dipole: -3.2164 3.9300 0.0051
dipole: 5.0784
quadrupole: -98.3861 -116.6589 -87.8352
quadrupole: -4.9651 -0.0398 -0.0111
quadrupole: 2.5740 -15.6989 13.1249 -4.9651 -0.0398 -0.0111
hfenergy: -868.1062275 hartree
pointgroup: C01 [X(C8H6N2O6)]
dipole: -1.2628922 1.5482524 0.0064663 debye
dipolederiv: -1.0947213 -0.1860662 0.0130875 -0.2619265 -0.4453716 0.0047372 0.0142661 0.0044212 -0.3113364 -0.8517664 -0.1650683 0.0085666 -0.3120735 -0.7040154 0.0076819 0.0090441 0.0048014 -0.2965959 -0.432355 0.3134075 0.0004742 0.0988003 -0.9175375 0.0046861 0.0020047 0.0025435 -0.1923416 -0.4713564 -0.0272763 0.0009379 -0.0566452 -0.8515341 0.0025483 0.0015458 0.003122 -0.2176902 -0.8660327 -0.2379086 0.0093622 -0.0994835 -0.5439071 0.0036433 0.0084746 0.005437 -0.2575221 -0.6853581 0.0731061 0.0018202 0.1674122 -0.4652195 -0.0005894 0.0022131 -0.0003638 -0.1872836 1.0711175 0.2147231 -0.0119147 0.2591995 1.8970679 -0.0172976 -0.0121382 -0.0172383 0.2084459 1.1150931 -0.3114605 -0.0017192 -0.3116692 1.5929431 -0.0026478 -0.0039207 -0.0034517 0.1835756 -0.7342392 0.0171593 0.0092356 0.0499298 -0.7885887 0.005169 0.0094655 0.0052544 -0.0171653 -0.4924829 -0.4909308 0.0107747 -0.0037037 -0.8212404 0.0064972 0.0076569 0.0131693 0.0325236 -0.5099026 0.3126751 0.0041493 -0.1400298 -0.3841415 0.0050778 0.0072299 -0.0005816 0.0333586 0.9910674 0.1248516 -0.0143334 0.2484771 0.4433371 -0.0061545 -0.0158455 -0.0039923 0.1480826 0.2551608 0.6232962 -0.009092 0.1459132 0.3348162 -0.0046909 -0.0050939 -0.0107668 -0.0604186 0.3087608 -0.4896579 -0.0013066 -0.1233208 0.2050244 0.0000976 -0.0026467 0.0040479 -0.0234973 1.7848826 0.0942429 -0.0221732 0.0716816 0.7889619 -0.0064423 -0.0216916 -0.0061231 0.1243869 -0.2991741 0.1750256 0.0029431 0.3243881 -0.2899085 -0.0015654 0.0013548 0.0005763 0.0454689 0.1307587 0.0203868 0.0002597 0.0764374 0.0986471 -0.0006982 -0.0006407 -0.000078 0.1515463 0.2109538 -0.0308861 -0.0002564 0.0001551 0.1601513 0.0000725 -0.0011133 0.0006199 0.1609374 0.0921321 -0.0248185 0.0759698 -0.0181513 0.0552807 0.0735374 0.0493753 0.0776985 -0.0124584 0.0897875 -0.027435 -0.0775797 -0.0201229 0.0532587 -0.0740005 -0.0509434 -0.0780487 -0.007858 -0.0726872 -0.0175204 0.0023069 -0.0834941 0.0858029 0.0011827 0.0026128 0.0005047 0.1281467 0.4603616 0.0401544 -0.0015125 -0.0117739 0.4961731 -0.0008444 -0.0012094 -0.0015515 0.3676949 unknown
polarizability: 179.5729469|6.3748301|176.6173789|-1.6348366|-0.9739773|51.4029927 unknown
InChI: InChI=1S/C8H6N2O6/c1-4(11)5-2-6(9(13)14)8(12)7(3-5)10(15)16/h2-3,12H,1H3
charge 0 multiplicity 1
22 atoms
O  2.677994 0.323164 -0.066172
O  -3.457914 -1.618447 0.030796
O  0.127065 3.634695 -0.056618
O  0.890148 -3.516372 -0.017882
O  2.248316 2.81125 -0.075664
O  2.82529 -2.315728 -0.034963
N  0.935995 2.644021 -0.05781
N  1.545124 -2.401782 -0.02664
C  -1.537409 -0.181421 -0.003151
C  0.417949 1.275618 -0.039633
C  0.730025 -1.147012 -0.026997
C  1.3354 0.156601 -0.044574
C  -0.981741 1.109768 -0.019269
C  -0.661681 -1.300864 -0.007305
C  -3.025766 -0.432299 0.018354
C  -3.968794 0.761204 0.019844
H  -1.603703 2.008986 -0.016811
H  -1.087487 -2.309717 0.005531
H  -3.819914 1.390167 -0.877953
H  -3.801816 1.40181 0.906162
H  -5.006757 0.397578 0.032871
H  2.863076 1.341082 -0.075416
