program: Gaussian 09
title: 000104127
version: EM64L-G09RevD.01
frameworkgroup: C1[X(C20H12BrClN2O2)]
method: RPBEPBE
basis: SDD
operation: Freq
keyword: #p
keyword: freq=noraman
keyword: PBEPBE/SDD
title: #p freq=noraman PBEPBE/SDD
converged: YES YES NO NO
title: Mulliken charges:
elementType: Br Cl O O N N C C C C C C C C C C C C C C C C C C C C H H H H H H H H H H H H
charge: 0.040830 -0.061754 -0.316827 -0.304820 -0.495579 -0.662961 0.094733 0.154943 0.285552 0.296822 0.276136 -0.134540 -0.157135 0.498064 -0.379365 -0.555735 -0.387358 -0.384212 0.460019 -0.229237 -0.228765 -0.344337 -0.443438 -0.083599 -0.176452 -0.264866 0.299759 0.381803 0.292941 0.293699 0.238062 0.238140 0.319937 0.390694 0.296835 0.255586 0.235723 0.260703
chargesum: 0.00000
title: Mulliken charges with hydrogens summed into heavy atoms:
elementType: Br Cl O O N N C C C C C C C C C C C C C C C C C C C C
charge: 0.040830 -0.061754 -0.316827 -0.304820 -0.113776 0.047670 0.094733 0.154943 0.285552 0.296822 0.276136 -0.134540 -0.157135 0.498064 -0.079606 -0.555735 -0.094417 -0.090513 0.460019 0.008825 0.009374 -0.047502 -0.187853 -0.083599 0.059270 -0.004163
polarizability: 5.36850436e+02 2.26530105e+01 3.49009516e+02 -1.88004449e+01 2.52353938e+01 1.23430293e+02
1716.lowfreq: -5.3075 0.0007 0.0014 0.0018 2.9389 4.9205 22.1972 34.5617 38.8067
frequency: 22.1861 34.5420 38.8022 41.7413 84.8063 106.1529 128.0470 137.0379 149.3701 159.3268 185.5268 205.2120 213.3479 235.6014 257.1936 266.4932 281.0898 343.0809 364.6345 383.9925 387.2470 396.4457 416.5312 426.5249 433.3447 444.2362 453.2346 475.8326 500.1320 510.6443 543.7615 552.2135 557.8663 595.3689 613.5415 650.8301 658.4341 667.2199 673.2331 685.4180 716.6555 728.7952 743.9764 773.5109 784.3448 806.5587 851.1583 856.0472 859.2407 862.3385 877.4443 887.4361 896.5985 916.0603 929.7192 934.6120 973.5969 978.1066 980.1193 997.4622 1013.7444 1023.3743 1050.0247 1072.0474 1087.9505 1093.4235 1130.6907 1169.6117 1173.3878 1176.9098 1240.6382 1246.9249 1269.2879 1278.2344 1300.4955 1317.9179 1348.1810 1369.1667 1373.9937 1382.1221 1403.8047 1410.4625 1430.1356 1448.0396 1453.1754 1468.5764 1480.7190 1508.9920 1523.3615 1558.1012 1562.8015 1586.6361 1603.0524 1607.1957 1609.7620 1625.6233 2942.5250 3135.2969 3141.4022 3152.5894 3160.2340 3166.6049 3171.6117 3173.8320 3181.1749 3184.7616 3208.7476 3592.5991
redmass: 9.9293 7.2277 6.8865 13.5018 6.5446 6.6315 8.8479 10.2560 6.0314 6.7854 5.2039 6.8374 13.6235 6.3711 5.9196 6.4836 5.7131 5.3224 5.9373 6.4641 9.5964 10.1521 6.8510 3.8529 4.1791 3.8090 11.7191 7.3453 3.3259 5.9445 6.0097 1.2789 5.6970 6.3899 5.3967 5.9909 6.0440 6.0272 5.4656 2.7962 5.1559 3.0927 4.2914 3.3300 1.8832 1.8443 3.2224 3.0020 1.5096 1.1803 7.3269 1.4089 2.9703 1.4298 1.6803 1.6686 1.3604 5.2401 5.5187 1.3870 1.3609 2.6952 2.1230 2.0169 2.4413 1.5656 2.3203 1.3313 1.6112 1.1042 2.7282 1.5785 2.4702 1.4261 1.7510 3.6912 4.0201 4.1500 6.9170 7.1299 8.5685 3.4075 3.1804 3.6346 3.3157 2.6457 4.0101 6.5078 7.2962 2.8693 3.5193 2.5346 5.3837 4.7812 3.4043 4.5113 1.0848 1.0864 1.0873 1.0909 1.0945 1.0943 1.0925 1.0994 1.0976 1.0919 1.0648 1.0880
irintensity: 0.1840 0.1693 1.3572 0.7061 0.8892 3.2057 0.2194 0.0505 0.4936 1.0704 0.4793 0.0855 1.2020 1.4546 2.4218 1.3925 3.1423 3.6088 8.9925 2.8065 6.6049 1.0514 16.1975 0.5087 6.9546 2.3109 5.8558 17.5904 2.9310 10.3950 4.6735 124.8598 10.5179 4.8097 15.5388 1.7224 16.9073 23.5010 0.6831 31.4075 11.4233 23.7804 12.4296 16.2392 44.1213 53.7786 78.5333 18.9885 95.5370 68.5084 2.1851 39.9483 52.6098 6.6476 22.6728 26.0137 2.7854 3.9496 20.6381 5.6398 0.0744 63.4277 44.1930 32.0520 10.4296 11.7336 14.9310 4.9430 4.9392 2.4956 12.2055 2.9647 31.7788 14.7061 220.3107 595.8411 164.9841 20.8090 6.3247 10.9830 46.7402 89.2782 16.9733 9.8402 7.6505 43.5555 108.1812 10.5083 849.3568 107.9772 119.9528 100.8301 271.9809 13.8531 31.1929 46.3079 83.1312 4.1247 10.2722 16.2208 8.1737 1.3225 2.1494 33.8313 4.4752 0.6388 41.6029 101.8264
temp: 298.150 k
press: 1.00000 atm
elementType: 35 17 8 8 7 7 6 6 6 6 6 6 6 6 6 6 6 6 6 6 6 6 6 6 6 6 1 1 1 1 1 1 1 1 1 1 1 1
symmnumber: 1
zpe: 707256.0 jmol-1
zpe.correction: 0.269380 hartree
zpe.thermalcorrener: 0.290339 hartree
zpe.thermalcorrenthalpy: 0.291283 hartree
zpe.thermalcorrgfe: 0.217801 hartree
zpe.sumelectzpe: -1501.093573 hartree
zpe.sumelectthermal: -1501.072613 hartree
zpe.sumelectthermalent: -1501.071669 hartree
zpe.sumelectthermalfe: -1501.145151 hartree
dipole: -0.5403 -0.6240 -1.1356
dipole: 1.4039
quadrupole: -156.3977 -151.0518 -169.6893
quadrupole: 1.1052 -8.1220 4.4612
quadrupole: 2.6486 7.9945 -10.6430 1.1052 -8.1220 4.4612
hfenergy: -1501.3629525 hartree
pointgroup: C01 [X(C20H12Br1Cl1N2O2)]
dipole: -0.1669729 -0.2692417 -0.4524517 debye
polarizability: 530.1254088|42.828192|356.8271757|-7.4724503|24.0071163|122.3376611 unknown
InChI: InChI=1S/C20H12BrClN2O2/c21-14-9-15(24-11-5-3-4-10(22)8-11)16-17(18(14)23)20(26)13-7-2-1-6-12(13)19(16)25/h1-9,24H,23H2
charge 0 multiplicity 1
38 atoms
Br 1.260461 4.503096 -0.342907
Cl 6.12017 0.849426 1.765972
O  -0.471349 -2.305969 -0.348855
O  -3.763426 2.107517 0.253079
N  1.608095 -0.826995 -0.382441
N  -1.752231 3.697336 0.086961
C  -0.644926 0.104326 -0.154727
C  -1.506562 1.258852 -0.030184
C  0.780633 0.281156 -0.268471
C  -2.675625 -1.414413 -0.01201
C  -3.521946 -0.278063 0.134515
C  -1.214215 -1.249729 -0.17715
C  -2.961491 1.096167 0.123387
C  -0.95785 2.592756 -0.045538
C  1.307708 1.61584 -0.333625
C  0.469152 2.711279 -0.225437
C  -3.238286 -2.717417 -0.004224
C  -4.920591 -0.45903 0.288195
C  3.016452 -0.903567 -0.279508
C  -4.626196 -2.887731 0.151125
C  -5.470406 -1.754418 0.297813
C  3.774526 -0.062565 0.584513
C  3.682487 -1.925775 -1.013375
C  5.166042 -0.242789 0.656128
C  5.077311 -2.086604 -0.901951
C  5.847301 -1.236253 -0.072244
H  2.373904 1.766475 -0.511699
H  1.044733 -1.715595 -0.480155
H  -2.563776 -3.570785 -0.120636
H  -5.546019 0.431968 0.396918
H  -5.057156 -3.894677 0.15869
H  -6.550696 -1.889988 0.417818
H  -1.342937 4.630547 0.064026
H  -2.767976 3.509553 0.196243
H  3.286499 0.674974 1.226354
H  3.09899 -2.577432 -1.672172
H  5.579412 -2.873532 -1.474297
H  6.931685 -1.347841 0.007868
