program: Gaussian 09
title: 000104244
version: EM64L-G09RevD.01
frameworkgroup: C1[X(C19H20N6O3)]
method: RPBEPBE
basis: SDD
operation: Freq
keyword: #p
keyword: freq=noraman
keyword: PBEPBE/SDD
title: #p freq=noraman PBEPBE/SDD
converged: YES YES NO NO
title: Mulliken charges:
elementType: O O O N N N N N N C C C C C C C C C C C C C C C C C C C H H H H H H H H H H H H H H H H H H H H
charge: -0.228846 -0.201839 -0.201605 -0.177987 -0.466912 -0.116176 -0.094984 0.020380 -0.062189 0.415127 -0.346624 -0.368044 0.184183 -0.369931 0.041205 -0.711639 -0.690594 -0.218834 -0.324295 0.206910 -0.802403 0.045623 0.321727 -0.315062 0.410012 -0.493470 -0.349952 -0.153926 0.200984 0.227108 0.227064 0.245330 0.246972 0.213816 0.277119 0.211344 0.220444 0.223820 0.222373 0.230360 0.277172 0.372963 0.285417 0.249171 0.241189 0.269939 0.312458 0.295104
chargesum: 0.00000
title: Mulliken charges with hydrogens summed into heavy atoms:
elementType: O O O N N N N N N C C C C C C C C C C C C C C C C C C C
charge: -0.228846 -0.201839 -0.201605 -0.177987 -0.093949 -0.116176 -0.094984 0.020380 -0.062189 0.415127 0.081468 0.104350 0.184183 -0.122959 0.041205 -0.009361 -0.023957 0.011526 -0.047124 0.206910 -0.026626 0.045623 0.321727 -0.045122 0.410012 -0.181013 -0.054849 -0.153926
polarizability: 6.63950828e+02 -6.91093191e+00 3.12995196e+02 -9.41730574e+00 -1.01708078e+01 1.42414243e+02
1716.lowfreq: -6.9594 -4.9304 -3.1046 -0.0001 0.0005 0.0006 16.5264 23.4247 42.1777
frequency: 16.1947 23.4066 42.1640 43.4295 58.7224 61.1232 69.4807 86.2560 92.4996 104.9287 112.8938 120.6362 129.3958 143.7139 147.8942 164.5472 171.8266 187.6126 202.2881 229.0423 234.6929 249.1774 263.5113 276.7327 290.4651 292.7659 311.4929 324.3465 361.9293 379.2635 394.4279 402.8748 420.8417 446.9279 469.3752 495.5200 502.7018 509.5404 532.4508 535.0029 563.7700 575.8987 583.3605 595.9669 614.0675 632.7857 668.5711 693.8478 700.5607 717.3264 730.2148 739.1174 772.6988 780.0554 790.9835 805.6364 818.4405 825.6437 866.7162 871.3256 891.4941 917.5335 923.0249 933.6005 953.3679 970.3872 995.2543 1004.9568 1010.8224 1039.1159 1049.4406 1058.4881 1078.4314 1080.7509 1083.1673 1121.6771 1122.9458 1153.4649 1173.4489 1180.2969 1183.4638 1200.9129 1207.2727 1212.7944 1251.2688 1257.3536 1272.4982 1283.0276 1287.7125 1325.3922 1348.7991 1357.0112 1363.6054 1367.0766 1378.8084 1382.9147 1387.9306 1389.3316 1392.6647 1405.7315 1416.1810 1454.8748 1461.4858 1465.6499 1466.2716 1467.2215 1474.3621 1478.3420 1482.8905 1485.5209 1488.1801 1502.2374 1554.3145 1558.9672 1580.1260 1604.7441 1628.8311 2159.5015 2923.1701 2982.7632 2984.7204 2988.7583 2994.6515 3045.8909 3070.7409 3078.7301 3081.6428 3086.0449 3097.2678 3107.5183 3123.5648 3139.4022 3161.7575 3171.4069 3178.5631 3186.8545 3192.4557 3402.6993
redmass: 5.5893 4.7195 5.0953 3.5679 5.8325 4.6639 3.6891 2.3411 4.0201 3.0577 1.7293 4.9914 4.6665 3.6768 3.9766 8.4096 6.2255 5.0170 3.6051 2.4630 4.7106 1.4272 5.7306 1.9681 3.0679 3.5120 2.4783 5.4328 5.0476 5.2136 6.3331 4.1343 6.1409 3.4605 8.4763 3.8524 7.3497 4.0867 4.8673 3.9197 3.7902 6.6358 3.9684 5.2354 4.5982 5.9973 5.3290 4.3866 6.5356 1.6097 6.1415 2.1396 3.1348 1.2129 2.0150 1.6137 3.7876 2.7323 4.9419 1.5230 1.4661 5.1122 6.3409 1.8364 1.4776 1.3253 2.6454 1.3584 1.7235 1.7647 2.4089 2.5425 2.0804 1.8741 1.9380 1.7009 1.5953 1.9731 1.3977 3.7777 2.8007 3.3674 5.2995 3.2046 2.3409 1.5591 2.2938 1.5916 1.1485 6.4707 1.3184 1.8598 8.9210 2.5444 4.9144 1.3674 1.2221 2.0068 1.2199 2.5528 5.1336 2.3700 2.0624 1.1636 1.0536 1.1327 1.4097 1.0834 1.3911 1.3882 1.0606 1.0836 5.0340 6.9949 6.4394 7.2883 5.0424 12.6165 1.0696 1.0354 1.0560 1.0468 1.0387 1.0914 1.0972 1.0981 1.0982 1.0941 1.0991 1.1013 1.1022 1.0868 1.0932 1.0894 1.0930 1.0957 1.0969 1.0773
irintensity: 0.0736 1.0741 0.2360 0.6961 1.0141 0.1726 0.8198 2.6094 2.9716 0.2410 1.4150 2.0455 7.7128 0.4819 6.2896 4.9030 2.1707 2.3356 2.3970 5.3535 0.1234 0.0157 1.5061 0.3015 0.7087 7.9266 1.0509 1.3076 4.7254 11.5217 2.6230 0.0833 0.6166 2.6995 3.6348 9.4115 1.7969 3.6315 7.5078 5.3174 30.8016 1.7664 22.1451 1.3371 3.7803 1.9790 15.4432 11.0033 18.4729 72.5062 35.3428 94.1759 7.0047 7.8237 33.8897 9.0705 2.9419 9.8589 20.3894 39.1671 3.6511 52.5855 5.3551 6.4939 23.7018 0.4525 22.5557 0.0232 36.1949 3.2486 37.7922 7.2476 83.5230 1.2096 32.7060 74.0681 1.4435 256.1904 36.1054 258.2423 330.6274 635.3880 399.4546 84.1177 33.0115 52.9654 37.8050 268.9632 12.5587 477.0277 15.4244 85.1508 130.6323 47.9936 49.3329 16.7506 20.3717 20.8332 67.2135 5.1255 31.0573 355.4381 119.6901 130.2461 22.2288 24.2877 121.8868 19.8793 8.5466 22.2243 0.5304 2.8381 91.0776 29.2197 51.1852 76.1765 176.5834 22.8818 106.5196 44.4583 13.1715 70.2724 19.3419 10.0843 4.8722 59.7589 24.4800 8.2045 34.5666 18.8444 2.7393 16.4210 19.3388 1.8900 4.5308 16.2571 1.8026 40.9673
temp: 298.150 k
press: 1.00000 atm
elementType: 8 8 8 7 7 7 7 7 7 6 6 6 6 6 6 6 6 6 6 6 6 6 6 6 6 6 6 6 1 1 1 1 1 1 1 1 1 1 1 1 1 1 1 1 1 1 1 1
symmnumber: 1
zpe: 962842.1 jmol-1
zpe.correction: 0.366727 hartree
zpe.thermalcorrener: 0.393941 hartree
zpe.thermalcorrenthalpy: 0.394885 hartree
zpe.thermalcorrgfe: 0.307533 hartree
zpe.sumelectzpe: -1288.055653 hartree
zpe.sumelectthermal: -1288.028439 hartree
zpe.sumelectthermalent: -1288.027495 hartree
zpe.sumelectthermalfe: -1288.114847 hartree
dipole: 5.1649 3.1572 1.7389
dipole: 6.2983
quadrupole: -189.3660 -155.5173 -167.9187
quadrupole: -8.2496 11.5117 -2.8064
quadrupole: -18.4320 15.4167 3.0153 -8.2496 11.5117 -2.8064
hfenergy: -1288.4223798 hartree
pointgroup: C01 [X(C19H20N6O3)]
dipole: 2.0811249 -1.3255389 0.2279609 debye
polarizability: 660.2323353|32.7188176|252.9280594|31.4354642|-80.7562664|206.1998714 unknown
InChI: InChI=1S/C19H20N6O3/c1-4-24(5-2)18-8-6-7-17(19(18)21-13(3)26)23-22-16-10-9-15(25(27)28)11-14(16)12-20/h6-11,21H,4-5H2,1-3H3
charge 0 multiplicity 1
48 atoms
O  3.306536 2.643347 0.714137
O  -7.65249 -0.346492 -0.325666
O  -6.846179 1.299458 -1.689393
N  4.455984 0.140315 0.037324
N  1.696244 1.243278 -0.274915
N  -0.393212 -0.306102 0.491964
N  -1.420471 -1.007867 0.927855
N  -6.686934 0.347839 -0.829973
N  -1.088564 2.02134 -1.619023
C  3.338074 -0.405097 0.676733
C  5.748887 0.234521 0.754143
C  4.437318 0.463998 -1.405618
C  1.985665 0.052843 0.42774
C  3.493328 -1.464604 1.619472
C  0.876005 -0.733803 0.919952
C  6.486897 1.564766 0.493563
C  5.352501 -0.465487 -2.237439
C  2.391921 -2.152406 2.184197
C  1.083919 -1.838448 1.799528
C  2.369252 2.478786 -0.115242
C  1.878651 3.582545 -1.043612
C  -2.675834 -0.573793 0.433246
C  -2.915403 0.485557 -0.517627
C  -3.790434 -1.299711 0.941609
C  -5.308681 0.03004 -0.392958
C  -4.239664 0.775423 -0.924981
C  -5.102442 -1.009955 0.543384
C  -1.862663 1.281977 -1.08373
H  6.415552 -0.621046 0.502918
H  5.529117 0.172391 1.834241
H  4.731627 1.51967 -1.565531
H  3.403199 0.362486 -1.770173
H  4.505594 -1.807402 1.855634
H  7.382362 1.617806 1.139617
H  5.82211 2.41208 0.729601
H  6.828544 1.658598 -0.55293
H  5.285225 -0.196003 -3.307833
H  5.047317 -1.5214 -2.126526
H  6.41185 -0.378329 -1.936486
H  2.579393 -2.976323 2.880874
H  0.216046 -2.40037 2.151479
H  0.760635 1.294647 -0.70484
H  0.874458 3.387698 -1.452347
H  1.884873 4.538598 -0.496155
H  2.584626 3.682158 -1.889688
H  -3.578731 -2.097374 1.659029
H  -4.446313 1.571107 -1.645932
H  -5.961493 -1.56226 0.931881
