program: Gaussian 09
title: 000104080
version: EM64L-G09RevD.01
frameworkgroup: C1[X(C10H10N2O6)]
method: RPBEPBE
basis: SDD
operation: Freq
keyword: #p
keyword: freq=noraman
keyword: PBEPBE/SDD
title: #p freq=noraman PBEPBE/SDD
converged: NO YES NO NO
title: Mulliken charges:
elementType: O O O O O O N N C C C C C C C C C C H H H H H H H H H H
charge: -0.411290 -0.230928 -0.186694 -0.189877 -0.194049 -0.188047 0.019492 0.023586 -0.456268 -0.387712 0.374577 -0.494411 0.228352 -0.337179 -0.515598 0.434175 -0.417894 0.176267 0.249268 0.249296 0.222826 0.224711 0.255221 0.255620 0.281602 0.337812 0.295847 0.381294
chargesum: 0.00000
title: Mulliken charges with hydrogens summed into heavy atoms:
elementType: O O O O O O N N C C C C C C C C C C
charge: -0.029995 -0.230928 -0.186694 -0.189877 -0.194049 -0.188047 0.019492 0.023586 0.042295 0.059825 0.374577 0.016430 0.228352 -0.055578 -0.177786 0.434175 -0.122047 0.176267
polarizability: 2.14619871e+02 1.21231099e+01 1.72723605e+02 1.42980291e-01 1.72493289e-01 6.73113954e+01
1716.lowfreq: -21.7765 -9.1595 -4.2294 -0.0007 -0.0007 0.0005 0.3388 19.8688 36.0972
frequency: -21.0548 19.8533 36.0751 54.1748 55.3523 74.8081 126.8158 145.5869 153.5323 158.7332 161.7937 212.0565 290.5791 297.5546 342.2979 354.4745 397.6236 436.0079 462.8984 494.6153 504.6243 506.1218 579.8394 601.0417 635.0025 642.8633 647.6299 673.0606 690.5458 721.5651 753.0048 758.1474 766.0601 827.7085 865.3257 879.3932 881.1918 972.4372 1003.3332 1025.8929 1048.1769 1064.7195 1069.2285 1084.7174 1112.7177 1146.4143 1153.7520 1182.8045 1205.1398 1215.8754 1235.2448 1265.6101 1271.7119 1275.9952 1295.8227 1335.8663 1354.9383 1373.9105 1383.5618 1392.1051 1419.5012 1425.1950 1439.3236 1470.3088 1480.5195 1585.8982 1610.8517 1666.1555 2983.4305 2989.7233 2997.9223 3018.6487 3037.6821 3064.5756 3177.5365 3190.7504 3195.8985 3512.8522
redmass: 11.3034 12.4201 6.7079 8.4580 10.6669 3.3455 2.0263 2.7245 10.9708 4.8525 10.0631 7.7997 4.1336 7.8595 12.7965 7.8432 5.7358 3.4167 5.4544 3.5978 3.1845 3.0698 5.2384 4.6276 7.0211 1.3148 4.7643 9.6256 2.3480 4.9757 1.7472 8.9164 6.8495 1.4636 6.3475 1.4795 5.0945 1.4315 1.3654 3.5710 2.6877 1.9242 2.4985 2.3480 3.9500 1.5464 1.1873 3.3804 4.9333 10.7317 1.3723 1.1877 1.4728 1.6760 1.0641 2.0201 4.3751 2.5376 3.5878 4.2169 4.6943 1.2587 1.0883 1.6689 1.4385 8.6151 6.7691 8.3132 1.0623 1.0612 1.0593 1.0963 1.0991 1.1028 1.0893 1.0917 1.0955 1.0640
irintensity: 0.1752 1.9545 1.6684 1.0346 0.9195 0.1392 2.1112 0.2263 4.4471 1.6574 0.5409 0.3387 2.4852 1.8706 1.7985 1.9341 10.6621 1.1186 29.6745 0.3250 19.3833 21.0770 14.6464 0.3091 15.8847 126.4417 15.5263 26.9670 8.5221 6.1499 15.9497 12.3109 14.8660 17.1726 5.0775 11.1701 10.2485 25.2628 0.5891 173.2793 107.5556 3.6211 26.9062 58.9059 24.9883 10.1967 0.0429 131.1461 126.7505 235.4310 12.5839 0.5644 15.0569 37.5511 0.2063 7.9911 73.2298 79.3773 37.2503 56.5421 54.5687 10.5043 39.5520 29.4622 13.7639 13.9376 60.0680 199.0381 5.8454 5.1517 20.2168 0.5345 0.1667 32.0218 3.2418 18.9909 4.2921 27.2277
temp: 298.150 k
press: 1.00000 atm
elementType: 8 8 8 8 8 8 7 7 6 6 6 6 6 6 6 6 6 6 1 1 1 1 1 1 1 1 1 1
symmnumber: 1
zpe: 520044.8 jmol-1
zpe.correction: 0.198075 hartree
zpe.thermalcorrener: 0.214060 hartree
zpe.thermalcorrenthalpy: 0.215004 hartree
zpe.thermalcorrgfe: 0.151804 hartree
zpe.sumelectzpe: -946.427465 hartree
zpe.sumelectthermal: -946.411480 hartree
zpe.sumelectthermalent: -946.410536 hartree
zpe.sumelectthermalfe: -946.473736 hartree
dipole: 5.5193 -1.1559 0.0436
dipole: 5.6392
quadrupole: -118.4318 -125.0985 -100.4090
quadrupole: -0.9134 0.2163 -0.2070
quadrupole: -3.7854 -10.4520 14.2374 -0.9134 0.2163 -0.2070
hfenergy: -946.6255401 hartree
pointgroup: C01 [X(C10H10N2O6)]
dipole: -2.1684221 0.4689103 0.0195595 debye
polarizability: 214.7753297|11.8485871|172.5669028|-0.3581251|-0.3103413|67.3126391 unknown
InChI: InChI=1S/C10H10N2O6/c13-10(14)3-1-2-7-4-5-8(11(15)16)6-9(7)12(17)18/h4-6,13H,1-3H2
charge 0 multiplicity 1
28 atoms
O  -6.299274 0.150427 0.041612
O  -4.901375 2.00315 -0.04823
O  2.165976 -3.223631 -0.008258
O  -0.102235 -3.103307 -0.012143
O  4.166354 2.67217 -0.007037
O  5.016055 0.55316 -0.008662
N  1.065351 -2.55205 -0.00801
N  4.034848 1.388547 -0.010019
C  -1.437316 -0.722053 -0.003288
C  -2.531757 0.363245 0.002682
C  -0.000311 -0.214418 -0.005434
C  -3.932515 -0.277353 0.005787
C  1.157401 -1.059196 -0.007253
C  0.257183 1.185924 -0.005419
C  2.473127 -0.549925 -0.008585
C  2.653265 0.839962 -0.008476
C  1.555074 1.724388 -0.007015
C  -5.038756 0.761041 -0.004248
H  -1.571431 -1.396775 0.864805
H  -1.575881 -1.391239 -0.87501
H  -2.437103 1.016641 0.890692
H  -2.444101 1.021305 -0.882366
H  -4.07663 -0.935368 -0.873699
H  -4.080305 -0.927062 0.890115
H  -0.588587 1.876125 -0.004381
H  3.328547 -1.229717 -0.009773
H  1.729969 2.803485 -0.007158
H  -7.007474 0.850526 0.029872
