program: Gaussian 09
title: 000104068
version: EM64L-G09RevD.01
frameworkgroup: C1[X(C9H9BrO2)]
method: RPBEPBE
basis: SDD
operation: Freq
keyword: #p
keyword: freq=noraman
keyword: PBEPBE/SDD
title: #p freq=noraman PBEPBE/SDD
converged: NO NO NO NO
title: Mulliken charges:
elementType: Br O O C C C C C C C C C H H H H H H H H H
charge: -0.028792 -0.439613 -0.250017 0.480176 -0.508802 -0.383116 -0.382721 0.249367 -0.672169 -0.347743 -0.323127 0.116420 0.244001 0.244230 0.242420 0.241154 0.291281 0.291696 0.273080 0.275903 0.386372
chargesum: 0.00000
title: Mulliken charges with hydrogens summed into heavy atoms:
elementType: Br O O C C C C C C C C C
charge: -0.028792 -0.053241 -0.250017 0.480176 -0.020572 -0.140696 -0.141567 0.249367 -0.089192 -0.074663 -0.047224 0.116420
polarizability: 2.06754597e+02 -1.20089713e+00 1.04110270e+02 1.36937664e+01 -7.26607357e-01 5.92126685e+01
1716.lowfreq: -5.8097 -0.0003 -0.0002 0.0002 5.8740 18.6854 33.0368 46.0988 70.5787
frequency: 32.8132 46.0934 70.2433 76.5838 139.9628 167.5212 183.4718 300.8956 339.0220 364.6690 406.3196 485.8500 491.0538 556.9085 592.4959 620.2871 632.3231 689.9232 712.8909 767.4333 771.2406 816.1750 864.3522 872.3994 957.9034 988.8425 998.4829 1004.7735 1025.5976 1033.7112 1093.9321 1134.1422 1150.4560 1195.1834 1212.1438 1233.8522 1266.7498 1310.0498 1311.3764 1323.6619 1388.2349 1410.9584 1452.6435 1479.9790 1499.7013 1575.9385 1619.6998 1639.2680 3013.4300 3054.0479 3073.5435 3126.5457 3129.0732 3140.5979 3161.5936 3175.4879 3525.9491
redmass: 5.4334 8.1782 3.5915 3.4809 7.2364 8.0172 5.1893 4.9033 2.8225 7.0815 2.8551 5.0986 3.4910 5.6104 1.3864 3.1795 6.9397 3.7662 3.6805 4.5567 1.1340 4.3735 1.2704 1.7466 1.4080 1.3758 1.3770 4.4184 3.0494 4.1052 1.2456 1.1805 1.7152 1.1710 2.6360 1.2105 1.2212 1.3498 1.3411 2.6318 5.7707 3.1134 1.0904 1.1155 2.5341 7.2268 6.3289 8.6105 1.0597 1.0563 1.1039 1.0899 1.0902 1.1114 1.0954 1.0951 1.0642
irintensity: 0.7043 0.4057 1.6189 1.0429 0.4855 3.3815 1.0409 1.3776 0.2473 18.0082 0.3459 15.1092 33.0281 7.5223 104.0367 73.6075 0.7447 64.8863 39.4402 6.1611 4.5522 4.7555 2.1064 33.5149 8.9690 2.0778 0.2716 158.6039 137.6244 11.9792 2.2504 8.5684 124.1546 3.3015 0.9760 23.1656 1.3609 19.0841 25.5824 110.3245 3.5273 18.7188 3.2782 9.2978 9.0243 19.7004 46.7554 306.6009 12.7383 15.4899 6.3536 10.1251 9.3051 9.0029 3.8385 1.3519 50.5157
temp: 298.150 k
press: 1.00000 atm
elementType: 35 8 8 6 6 6 6 6 6 6 6 6 1 1 1 1 1 1 1 1 1
symmnumber: 1
zpe: 416949.3 jmol-1
zpe.correction: 0.158808 hartree
zpe.thermalcorrener: 0.170354 hartree
zpe.thermalcorrenthalpy: 0.171299 hartree
zpe.thermalcorrgfe: 0.118315 hartree
zpe.sumelectzpe: -511.408478 hartree
zpe.sumelectthermal: -511.396931 hartree
zpe.sumelectthermalent: -511.395987 hartree
zpe.sumelectthermalfe: -511.448971 hartree
dipole: -0.7741 -1.3460 0.2127
dipole: 1.5673
quadrupole: -92.1257 -76.7992 -81.0861
quadrupole: 9.8000 1.6038 0.9840
quadrupole: -8.7887 6.5378 2.2509 9.8000 1.6038 0.9840
hfenergy: -511.5672856 hartree
pointgroup: C01 [X(C9H9Br1O2)]
dipole: -0.2963671 -0.5321355 0.0959775 debye
dipolederiv: -0.8040683 0.0010787 0.088503 0.0001049 -0.1383349 -0.0003435 0.0238021 -0.0004266 -0.171324 -0.7595818 -0.4507811 -0.0253977 -0.6427178 -0.9756772 -0.070967 -0.0412051 -0.0591845 -0.4285403 -1.0509934 0.2823412 -0.0872992 0.2495571 -0.8063894 0.0336022 -0.1099448 0.0483015 -0.3460263 0.418775 -0.0007036 0.0238767 0.0085859 0.0854703 -0.0009857 0.2071507 -0.0020924 -0.0855286 -0.314884 0.0008699 0.0942354 -0.0010227 0.120098 -0.0005791 0.031266 -0.0011206 0.0782314 -0.2740884 0.1586011 0.0107785 0.1615061 0.032075 0.0307724 0.0092218 0.0247238 -0.156854 -0.2941247 -0.1524633 0.0118644 -0.1723624 0.0322811 -0.0365348 0.0108966 -0.0277471 -0.1574231 -0.8066693 -0.0168981 -0.0806881 -0.0028222 -0.061742 0.000792 -0.1192249 -0.0014468 -0.0163435 1.1035683 -0.0003381 -0.0548652 -0.0008371 0.1060025 0.0002293 -0.1742395 0.0007698 0.114134 0.1515914 -0.1109675 0.0323412 0.128986 0.0281855 0.0178875 0.0208162 -0.0161314 -0.089174 0.1771763 0.1107247 0.033538 -0.1137664 0.0204354 -0.0184727 0.0284669 0.0127791 -0.0893053 2.1241092 0.0851837 0.2231868 0.2295185 1.3893989 0.0137248 0.281495 -0.0031151 0.2665994 0.0266131 0.0139618 -0.0338809 0.0464214 -0.0379176 0.0993299 -0.0200778 0.060679 0.0207022 0.0265323 -0.0142649 -0.0333422 -0.046825 -0.0412136 -0.0978561 -0.0193399 -0.0590612 0.0242192 0.0268865 -0.0962115 -0.024542 -0.0942561 -0.0349946 -0.0101086 -0.0207226 -0.0129907 0.1391496 0.0253383 0.096151 -0.026825 0.0959924 -0.0362819 0.0145569 -0.0231793 0.0170997 0.1373073 -0.0692791 -0.0679435 -0.0503412 -0.0174809 -0.0076834 -0.0866413 -0.0117992 -0.050017 0.0283228 -0.0691369 0.0666942 -0.0517925 0.016952 -0.0042305 0.0869438 -0.0118028 0.0504491 0.0258748 0.0798082 0.0712907 -0.0087179 0.0449029 0.0199911 0.006539 -0.0151563 0.0107564 0.1535187 0.0859314 -0.0562716 -0.0071539 -0.0592492 0.014133 -0.0050362 -0.013678 -0.0052636 0.1563104 0.1964959 0.0799461 -0.0334783 0.1688128 0.2963948 0.0231472 -0.0327452 0.0130385 0.3961492 unknown
polarizability: 207.6344918|-0.3401415|104.0967614|7.6825181|-0.6125025|58.3462822 unknown
InChI: InChI=1S/C9H9BrO2/c10-6-5-7-1-3-8(4-2-7)9(11)12/h1-4,11H,5-6H2
charge 0 multiplicity 1
21 atoms
Br 5.451705 0.007848 -0.509276
O  -3.640292 -1.227836 -0.277872
O  -3.757306 1.090809 -0.326043
C  1.217457 0.014228 0.444069
C  2.728643 0.018417 0.64051
C  0.500218 1.23401 0.31695
C  0.503683 -1.20975 0.345923
C  -1.593504 0.003754 0.010183
C  3.430764 0.004641 -0.730806
C  -0.890987 1.233336 0.103567
C  -0.888599 -1.221218 0.132555
C  -3.063965 0.049916 -0.209362
H  3.049419 -0.86591 1.219563
H  3.04683 0.916111 1.200149
H  1.037335 2.187025 0.396225
H  1.044285 -2.158685 0.44784
H  3.208693 -0.904832 -1.30999
H  3.208122 0.901882 -1.32853
H  -1.453927 2.167949 0.010867
H  -1.440156 -2.163031 0.063186
H  -4.619717 -1.129865 -0.423508
