program: Gaussian 09
title: 000104093
version: EM64L-G09RevD.01
frameworkgroup: C1[X(C15H17N3O4)]
method: RPBEPBE
basis: SDD
operation: Freq
keyword: #p
keyword: freq=noraman
keyword: PBEPBE/SDD
title: #p freq=noraman PBEPBE/SDD
converged: YES YES NO NO
title: Mulliken charges:
elementType: O O O O N N N C C C C C C C C C C C C C C C H H H H H H H H H H H H H H H H H
charge: -0.312596 -0.275036 -0.288088 -0.430195 -0.434628 -0.399289 -0.698737 0.351087 0.380973 0.288722 0.000728 -0.445705 0.018640 -0.486350 0.172782 -0.363068 -0.276207 -0.548871 0.578993 -0.475965 -0.333736 -0.516304 0.376966 0.249681 0.257475 0.338404 0.241850 0.222934 0.242499 0.244227 0.224552 0.229091 0.194324 0.313653 0.312756 0.220209 0.230475 0.245352 0.348399
chargesum: 0.00000
title: Mulliken charges with hydrogens summed into heavy atoms:
elementType: O O O O N N N C C C C C C C C C C C C C C C
charge: -0.312596 -0.275036 -0.288088 -0.081796 -0.057662 -0.060884 -0.072327 0.351087 0.380973 0.288722 0.000728 -0.196024 0.018640 -0.228875 0.172782 0.101716 -0.033708 -0.304644 0.578993 -0.251413 0.089678 0.179733
polarizability: 4.84645485e+02 -7.45695122e+00 2.13590321e+02 -2.82622591e+01 -9.33536087e+00 1.07661699e+02
1716.lowfreq: -6.8363 -0.0008 0.0008 0.0008 3.4875 5.6129 19.1392 23.5052 32.9010
frequency: 18.5155 23.3540 32.7298 40.1184 58.2049 75.5564 85.6171 121.3241 136.0319 143.8600 146.4357 164.6287 180.7767 204.2752 213.8096 238.9968 269.7278 295.7236 313.5029 335.9072 369.3864 374.4876 381.1677 393.9946 425.5499 429.6651 446.2699 460.3469 468.2387 487.2096 503.9538 515.2794 539.1720 589.3516 625.7394 638.9143 699.8118 712.0300 726.6817 732.8605 737.7107 752.1443 775.6855 807.5283 826.1522 830.1622 835.8899 848.5397 858.1278 864.4023 893.2913 902.2589 927.4863 934.0839 974.9943 1015.7014 1035.3357 1073.0857 1095.4447 1104.2072 1112.0029 1149.2013 1169.1543 1172.3334 1190.9342 1211.5834 1226.4650 1230.4390 1245.3706 1290.0742 1302.8088 1317.7296 1329.6207 1331.5931 1351.6169 1364.3938 1383.2650 1386.8434 1429.4073 1456.9167 1458.7064 1462.8300 1465.9817 1470.5274 1481.1615 1491.7262 1516.5976 1539.6640 1564.7740 1581.5851 1613.5232 1634.9736 1638.1742 1646.6748 2944.6571 2955.7785 2965.4393 3051.7484 3057.2652 3089.7849 3127.7645 3134.6626 3146.1174 3163.7355 3184.9360 3197.7282 3257.2670 3346.9993 3547.9441 3565.1259 3705.2357
redmass: 4.2637 6.4220 4.1615 4.0940 5.7253 4.7576 6.1099 3.4744 3.6345 4.6826 1.2315 5.0389 4.1647 4.4965 5.3537 5.8981 2.5491 3.9017 3.5138 2.4974 3.1803 1.0701 1.7745 1.3543 4.4127 4.5396 3.1260 3.4709 5.2068 4.9627 7.4145 5.8174 5.1074 5.7495 5.3878 3.4843 5.9141 5.8160 3.2936 6.3324 2.1882 4.6518 1.1478 1.5248 1.8145 3.8044 2.0072 2.6806 1.7876 2.2537 3.0638 2.2713 1.1893 1.3891 3.3374 2.9696 1.4775 2.5607 2.1781 2.8620 1.2385 1.3768 1.7571 1.8817 1.6594 1.4351 1.1900 1.6849 1.8978 1.9644 1.6798 3.2870 1.6497 1.7232 2.3237 2.2048 1.2496 5.0552 1.3700 1.0944 1.0713 2.3413 1.2333 1.1477 2.5610 1.9920 4.0885 3.7087 6.2411 4.3453 8.9787 2.7281 7.4144 1.5722 1.0704 1.0674 1.0313 1.0940 1.1048 1.0936 1.1011 1.0903 1.0921 1.0914 1.0933 1.0907 1.0736 1.0751 1.0660 1.0450 1.1041
irintensity: 3.1225 1.3028 2.7537 2.5286 1.4297 5.2406 2.3025 3.6299 5.3941 3.3568 0.1898 6.1783 10.6713 6.0886 7.7185 3.2110 7.8984 9.0274 6.5486 59.5868 8.3530 33.0884 176.7675 267.2282 2.1124 20.2347 3.0824 6.1991 30.5655 18.2977 3.2224 3.5893 8.4473 2.8056 0.2281 5.2737 8.3251 1.1976 3.7718 0.0403 5.9465 2.8654 119.1588 46.6961 20.4378 13.5728 29.6165 45.8211 35.4863 37.1270 24.1553 17.2794 58.9675 2.1941 37.3678 69.2452 1.2144 73.0618 15.2037 81.8849 0.3844 10.2620 30.8630 8.2615 17.3571 24.5590 61.4844 20.2534 1.7598 175.7178 53.2923 261.0900 12.0493 30.1965 19.1627 22.3189 31.8020 68.5922 1.2710 123.6693 7.3593 19.7802 207.7734 10.5329 66.3622 599.6257 85.7025 20.4440 86.0934 220.3247 625.3147 135.4927 55.5281 488.3206 47.6437 85.8749 55.8379 18.0663 42.5177 38.9590 19.3514 18.3166 16.8065 13.7039 1.0038 3.6672 102.3884 79.8630 4.6562 200.9950 23.7012
temp: 298.150 k
press: 1.00000 atm
elementType: 8 8 8 8 7 7 7 6 6 6 6 6 6 6 6 6 6 6 6 6 6 6 1 1 1 1 1 1 1 1 1 1 1 1 1 1 1 1 1
symmnumber: 1
zpe: 797743.4 jmol-1
zpe.correction: 0.303844 hartree
zpe.thermalcorrener: 0.325558 hartree
zpe.thermalcorrenthalpy: 0.326502 hartree
zpe.thermalcorrgfe: 0.250910 hartree
zpe.sumelectzpe: -1045.320268 hartree
zpe.sumelectthermal: -1045.298555 hartree
zpe.sumelectthermalent: -1045.297611 hartree
zpe.sumelectthermalfe: -1045.373203 hartree
dipole: 5.5345 -1.1797 2.7742
dipole: 6.3023
quadrupole: -82.7878 -130.6505 -137.2464
quadrupole: -18.8833 -6.8964 11.5676
quadrupole: 34.1071 -13.7556 -20.3515 -18.8833 -6.8964 11.5676
hfenergy: -1045.6241129 hartree
pointgroup: C01 [X(C15H17N3O4)]
dipole: 2.1617337 0.5420938 -1.0867559 debye
polarizability: 484.5534584|11.8912626|214.4472986|26.7226115|-5.4092859|106.8967483 unknown
InChI: InChI=1S/C15H17N3O4/c1-22-15-6-9(16)2-3-10(15)18-12-8-13(20)11(7-14(12)21)17-4-5-19/h2-3,6-8,17-19H,4-5,16H2,1H3
charge 0 multiplicity 1
39 atoms
O  3.437468 -1.986834 0.097591
O  -0.549731 -2.543856 0.599774
O  -2.671701 2.234508 -1.077652
O  -6.654215 0.726962 1.415604
N  1.12153 -0.56488 0.226746
N  -4.348827 0.289334 -0.498586
N  6.124654 2.099609 0.213745
C  -0.184164 -0.230083 -0.002028
C  -3.032672 -0.027168 -0.319449
C  2.316173 0.179946 0.183107
C  -1.100935 -1.432964 0.254841
C  -0.704397 0.988055 -0.448469
C  -2.116135 1.154345 -0.641921
C  -2.517809 -1.256353 0.085104
C  3.531706 -0.571713 0.108496
C  -5.493465 -0.612845 -0.341605
C  2.421515 1.592826 0.284445
C  4.787626 0.048328 0.120704
C  4.882787 1.467956 0.2037
C  3.676645 2.2245 0.288387
C  -6.749045 0.181776 0.060202
C  3.403214 -2.591441 -1.253539
H  1.226747 -1.570789 0.476036
H  -0.079175 1.842398 -0.7108
H  -3.149271 -2.1284 0.276085
H  -4.475555 1.235323 -0.900475
H  -5.268221 -1.348617 0.451312
H  -5.687383 -1.173909 -1.281129
H  1.526727 2.205714 0.407594
H  5.685422 -0.578519 0.083724
H  3.727191 3.316071 0.374365
H  -7.622396 -0.489698 0.080379
H  -6.944221 0.985761 -0.684238
H  6.193173 3.110579 0.285642
H  6.985566 1.562347 0.170787
H  4.340638 -2.37359 -1.799807
H  2.538957 -2.214913 -1.833651
H  3.301977 -3.674335 -1.089462
H  -5.816999 1.253368 1.491042
