program: Gaussian 09
title: 000104074
version: EM64L-G09RevD.01
frameworkgroup: C1[X(C7H12O7)]
method: RPBEPBE
basis: SDD
operation: Freq
keyword: #pfreq=noraman
keyword: PBEPBE/SDD
title: #p freq=noraman PBEPBE/SDD
converged: YES YES NO NO
title: Mulliken charges:
elementType: O O O O O O O C C C C C C C H H H H H H H H H H H H
charge: -0.241547 -0.424935 -0.445531 -0.462346 -0.453729 -0.448885 -0.216436 -0.119415 -0.157222 -0.070876 -0.086264 -0.238544 0.155940 -0.389437 0.260079 0.320681 0.249511 0.226905 0.259335 0.236429 0.232490 0.347779 0.366604 0.373086 0.373150 0.353178
chargesum: 0.00000
title: Mulliken charges with hydrogens summed into heavy atoms:
elementType: O O O O O O O C C C C C C C
charge: -0.241547 -0.077156 -0.078927 -0.089261 -0.080578 -0.095707 -0.216436 0.140664 0.163459 0.178635 0.140642 0.020791 0.155940 0.079482
polarizability: 1.17751191e+02 6.14478387e+00 9.83394136e+01 -2.29711743e+00 6.61803128e+00 7.62005782e+01
1716.lowfreq: -9.4363 -6.0314 0.0006 0.0006 0.0007 6.4314 42.2437 63.1458 73.6038
frequency: 42.1777 63.1356 73.5895 91.1241 99.4995 135.8396 213.5332 237.4342 247.6457 252.1361 282.6391 301.9648 308.5940 323.6054 335.7433 348.1534 368.9987 404.7903 435.2553 473.8795 495.9845 523.7181 531.4339 581.0713 628.6600 651.0286 761.3286 825.9764 864.9939 880.1175 917.1609 940.7954 983.2091 1002.8043 1017.8620 1026.2683 1039.5265 1053.1424 1080.1856 1093.4076 1130.7456 1161.9670 1185.1860 1205.7030 1226.8121 1248.7684 1263.6437 1270.0916 1283.6257 1296.8153 1312.7953 1328.3867 1329.9471 1348.0679 1360.7099 1367.8281 1384.3708 1416.5485 1453.6779 1657.3410 2951.8937 2969.0425 3008.9938 3019.2082 3030.0350 3097.2698 3106.3564 3475.6130 3490.4540 3526.1184 3557.4888 3570.2557
redmass: 5.8311 6.8016 4.2706 7.2411 5.5049 4.3912 5.5898 4.7359 4.3438 5.0673 3.5152 1.1895 2.7292 2.5518 2.3089 1.3925 5.0582 1.2362 3.0243 5.1482 5.3401 3.5648 1.1565 3.6710 4.4745 5.7885 5.2861 4.4845 2.8471 3.5544 5.7750 4.5542 4.8407 4.8899 2.5235 2.5026 3.8843 3.5093 2.7864 1.9473 2.4993 1.4446 1.3435 1.2389 1.3235 1.2158 1.3345 1.2412 1.3006 1.2744 1.3197 1.4638 1.3070 1.1895 1.1847 1.2022 1.4972 1.7949 1.0819 11.3823 1.0807 1.0837 1.0857 1.0589 1.0852 1.1073 1.0867 1.0654 1.0650 1.0660 1.0660 1.0666
irintensity: 3.8174 4.4051 4.1100 0.8477 2.0598 3.7007 23.2468 8.2806 12.5529 8.5524 29.6564 114.3702 22.1841 49.8659 21.8544 90.0492 18.3639 185.7939 8.2024 3.6181 12.3627 29.0601 232.7535 0.1571 16.6628 4.6655 16.7615 54.3762 16.9405 51.7965 22.9974 119.0653 24.0360 89.5025 83.9410 44.0346 16.1675 279.3807 6.3721 9.9349 138.1228 34.3756 35.0514 40.2785 23.6754 7.3531 29.5587 20.1530 34.3368 32.8804 29.7381 42.3315 4.4411 6.9761 17.6228 11.1306 7.7041 17.5533 6.8647 271.7167 19.8402 26.5168 20.6433 24.4637 19.5562 20.7184 1.5266 35.3598 40.7870 7.4936 18.0598 12.8407
temp: 298.150 k
press: 1.00000 atm
elementType: 8 8 8 8 8 8 8 6 6 6 6 6 6 6 1 1 1 1 1 1 1 1 1 1 1 1
symmnumber: 1
zpe: 520221.1 jmol-1
zpe.correction: 0.198142 hartree
zpe.thermalcorrener: 0.213116 hartree
zpe.thermalcorrenthalpy: 0.214060 hartree
zpe.thermalcorrgfe: 0.156291 hartree
zpe.sumelectzpe: -799.343650 hartree
zpe.sumelectthermal: -799.328676 hartree
zpe.sumelectthermalent: -799.327732 hartree
zpe.sumelectthermalfe: -799.385501 hartree
dipole: -0.9464 1.4027 0.3313
dipole: 1.7242
quadrupole: -77.7332 -95.8962 -82.1939
quadrupole: -5.7172 -6.6808 1.3296
quadrupole: 7.5412 -10.6218 3.0806 -5.7172 -6.6808 1.3296
hfenergy: -799.541792 hartree
pointgroup: C01 [X(C7H12O7)]
dipole: -0.3696715 -0.5523916 -0.1355613 debye
dipolederiv: -1.4142513 0.5295367 0.1088839 0.2591974 -0.6015567 -0.0402618 -0.0144923 -0.0069427 -0.3039127 -0.6052893 -0.1351031 0.0220767 -0.1378011 -0.1722022 0.0127207 -0.0317619 0.0808054 -0.7137266 -0.2929307 -0.2087648 -0.1093116 -0.2728824 -0.7588286 -0.0571114 -0.1274671 -0.1105833 -0.5846703 -0.5070683 0.175121 0.0742567 0.1820065 -0.6708391 -0.0329503 0.1123759 -0.0216317 -0.5437132 -0.8178218 0.1895536 -0.0105305 0.1267694 -0.3394513 0.1194362 -0.01689 0.1118829 -0.4777269 -0.9693052 -0.1183609 0.0091287 -0.1187303 -0.5648322 0.1082383 0.0043368 0.1196624 -0.162818 -0.7840217 0.2381883 0.0336812 0.3695931 -0.9272376 -0.1689617 0.1090543 -0.3075213 -0.3931371 0.3883567 -0.1446661 -0.0390701 -0.4262973 0.4620703 0.0822881 -0.17286 0.0343198 0.21513 0.1993995 0.0210507 0.0285298 0.1821214 0.0912104 0.0276147 0.1251332 -0.0337857 0.5407001 0.1913567 0.0962691 0.055604 0.2468543 0.6603995 0.1363675 0.08022 0.1249246 0.3074991 0.3045068 -0.1296944 -0.0894426 -0.2222338 0.3049197 0.0960046 0.0210273 0.0832032 0.3693923 0.5016852 -0.2049504 -0.078841 -0.340518 -0.2154208 -0.1921416 -0.1415188 -0.1444212 0.2239648 1.57442 -0.5195056 -0.049228 -0.4036782 1.087053 0.2971768 0.0252719 0.4376318 0.3388644 0.6601052 0.0035894 0.0574678 0.1301706 0.2029944 -0.0460549 0.0535018 -0.0176272 0.2184279 0.0556694 0.021466 -0.026968 0.0534451 0.0094106 0.0321866 -0.0345857 -0.0026189 -0.1000733 0.1260112 0.0355165 -0.0053538 0.0484776 0.029726 -0.0326189 -0.0314055 0.0049838 0.0495548 -0.0175293 -0.0189049 0.0662345 -0.0198865 -0.0082184 -0.0381537 0.0482943 -0.0117753 -0.0983169 0.0370848 0.0196475 -0.0328869 0.020538 0.0047243 -0.0260364 -0.0487185 -0.0505725 -0.1556354 -0.0236653 -0.0084942 0.0694185 0.0064726 0.0659251 -0.0111963 0.1097667 0.0016033 -0.0567094 0.025552 0.0304842 0.0045537 0.0583982 -0.0800843 -0.0677261 0.0258698 -0.1028038 0.0447423 0.0122846 0.0032515 -0.0450374 0.0020982 0.0866551 -0.0007475 -0.0536395 0.0510107 -0.0934094 0.3227008 0.092276 -0.0220111 0.0574376 0.0390723 -0.0508687 -0.0042692 -0.0356785 0.3369444 0.0876515 0.0735568 -0.0195473 0.1112652 0.3775619 -0.0268713 -0.0113437 -0.0412768 0.3309919 0.1707981 -0.0130758 0.0067846 -0.0349979 0.3934196 -0.0072724 -0.0321161 -0.0249578 0.3377877 0.4373575 -0.0709663 -0.0124248 0.0614195 0.1835752 -0.0558693 0.0530615 -0.0672798 0.3314073 0.3369428 0.0429792 0.0040328 0.0607609 0.3399539 -0.0571912 -0.046845 -0.0705513 0.0384419 unknown
polarizability: 118.0425737|-5.5524137|97.5814201|0.0709294|7.7610893|76.6671893 unknown
InChI: InChI=1S/C7H12O7/c8-1-2(9)6-4(11)3(10)5(12)7(13)14-6/h2-6,8-12H,1H2
charge 0 multiplicity 1
26 atoms
O  -0.054998 -1.147901 -0.228597
O  0.025383 1.220302 -1.916919
O  2.128806 2.2240 0.793831
O  -2.491932 1.471054 0.666091
O  3.551795 -0.4688 0.402276
O  -4.25547 -0.663662 0.511891
O  1.845865 -2.401994 -0.596495
C  -0.536467 0.201162 0.267241
C  0.273578 1.287129 -0.470439
C  1.785889 1.159193 -0.146885
C  -2.042464 0.246109 -0.003644
C  2.125843 -0.222283 0.485532
C  1.324208 -1.357106 -0.155959
C  -2.807526 -0.963009 0.569294
H  -0.367473 0.267233 1.359083
H  -0.080433 2.280428 -0.156866
H  2.360467 1.256121 -1.08977
H  -2.221461 0.322236 -1.097791
H  1.829404 -0.162518 1.55597
H  -2.555167 -1.895532 0.032937
H  -2.591892 -1.083791 1.644226
H  0.170667 0.289566 -2.231832
H  3.103749 2.187791 0.971754
H  -3.47495 1.371889 0.791931
H  3.690472 -1.382308 0.029027
H  -4.596994 -0.84891 -0.399187
