program: Gaussian 09
title: 000104131
version: EM64L-G09RevD.01
frameworkgroup: C1[X(C24H19NO7)]
method: RPBEPBE
basis: SDD
operation: Freq
keyword: #p
keyword: freq=noraman
keyword: PBEPBE/SDD
title: #p freq=noraman PBEPBE/SDD
converged: YES YES NO NO
title: Mulliken charges:
elementType: O O O O O O O N C C C C C C C C C C C C C C C C C C C C C C C C H H H H H H H H H H H H H H H H H H H
charge: -0.331693 -0.363189 -0.304818 -0.180850 -0.240902 -0.273710 -0.197597 -0.648192 0.237231 0.215567 0.270849 0.254447 -0.126654 0.056123 -0.219047 0.125585 0.197567 -0.566315 -0.381512 -0.384164 -0.232693 -0.229233 0.332572 -0.366821 -0.353401 0.343994 -0.312949 -0.343154 -0.389099 0.223772 -0.218508 -0.669567 0.258926 0.289311 0.291467 0.234920 0.234993 0.335558 0.387560 0.355646 0.268661 0.264388 0.254285 0.266709 0.246430 0.241334 0.232811 0.234458 0.216743 0.231426 0.230733
chargesum: 0.00000
title: Mulliken charges with hydrogens summed into heavy atoms:
elementType: O O O O O O O N C C C C C C C C C C C C C C C C C C C C C C C C
charge: -0.331693 -0.007542 -0.304818 -0.180850 -0.240902 -0.273710 -0.197597 0.074926 0.237231 0.215567 0.270849 0.254447 -0.126654 0.056123 -0.219047 0.125585 0.197567 -0.307389 -0.092201 -0.092696 0.002227 0.005761 0.332572 -0.098160 -0.089013 0.343994 -0.058664 -0.076445 0.098664 0.223772 0.248761 0.009335
polarizability: 5.58050940e+02 2.50070437e+01 2.79682755e+02 3.46879137e+01 -9.08426866e+00 1.81663804e+02
1716.lowfreq: -8.1572 -2.3097 -0.0003 0.0010 0.0013 3.2226 7.6821 9.9306 14.8606
frequency: 7.5522 9.0905 14.7679 24.3503 36.7200 43.7508 52.1523 53.1184 67.8327 104.3655 107.3454 125.5770 137.0745 145.8535 155.4009 157.6462 167.2355 200.7969 209.1383 243.0905 252.3904 263.5854 286.1772 298.9779 314.3772 333.8023 355.0444 362.7257 367.2046 378.3980 394.6065 414.0025 418.6602 422.7534 428.1816 443.3566 448.6794 480.0211 483.4964 498.7470 504.1348 507.0423 553.0798 563.8327 565.9553 594.4043 626.4874 633.3313 637.4869 653.2774 678.6410 691.8339 710.5178 724.1791 732.2119 743.5310 765.2229 798.7812 801.4778 807.9773 811.3158 821.5922 827.7191 833.1460 840.2895 845.7677 865.2413 879.4419 915.8772 925.0071 936.5035 941.1936 961.4093 992.0823 998.4276 999.3019 1001.4801 1013.2611 1014.1705 1030.7942 1032.7968 1080.5865 1093.8825 1106.8431 1112.1604 1130.5587 1136.3797 1139.0283 1159.5278 1168.1779 1170.4450 1184.0299 1185.8102 1202.4469 1236.2678 1244.6482 1250.2273 1266.2936 1286.4552 1291.8360 1311.9520 1344.8447 1347.8928 1362.7754 1379.9437 1388.7513 1396.5754 1402.2225 1410.5848 1418.0753 1443.5851 1452.1498 1455.0213 1464.2940 1469.9669 1474.1413 1486.1775 1487.3786 1520.0657 1536.0561 1549.1311 1573.6683 1590.1054 1593.1572 1610.7922 1616.0177 1630.6879 1679.3143 2962.9073 2997.5472 3013.1510 3023.6188 3072.8148 3094.4416 3109.6348 3132.1825 3132.5912 3149.6555 3150.7578 3162.2388 3162.6912 3170.9991 3171.5753 3181.9589 3296.5084 3526.1140 3623.1823
redmass: 5.9609 4.7021 6.4851 4.3408 6.6426 5.7659 5.5492 3.2383 5.6747 3.1827 4.9570 6.7280 6.2601 3.5474 5.1845 3.2738 6.0676 6.1157 5.6990 6.1302 1.2835 4.8173 6.6939 6.5801 6.5948 4.8660 4.6321 1.2797 6.4164 4.5821 7.1053 7.7026 3.1654 3.5935 7.2146 5.9834 6.8022 4.8445 5.6104 7.1998 3.4452 3.8579 5.7188 1.2101 3.3373 5.7929 5.2943 6.8957 5.9420 6.0586 5.7350 5.7528 4.7217 5.2576 3.6357 2.9295 5.4211 1.0993 4.1218 1.3915 1.8922 1.1318 4.9826 1.4905 1.8602 4.3881 2.7108 7.6281 5.7492 4.5931 1.9832 1.4172 1.3450 3.8890 1.3870 2.7594 1.8786 2.9836 1.3571 2.1133 3.9235 3.4157 2.5209 1.2983 2.2964 3.2707 1.5072 1.8302 1.5431 1.3093 1.2004 2.3423 1.8692 1.0902 4.2667 2.0204 1.1347 2.4137 3.6820 1.2900 3.9633 3.7607 1.4360 1.9795 2.9635 8.1479 7.4434 1.2705 3.4616 3.7105 2.7787 1.1321 4.0250 1.0399 2.7202 1.0629 1.2047 1.8813 8.7399 5.0684 2.1248 5.0905 7.5336 5.4984 6.7371 6.4872 7.7874 10.7926 1.0562 1.0359 1.0583 1.1032 1.1067 1.0985 1.1029 1.0912 1.0861 1.0905 1.0885 1.0888 1.0944 1.0994 1.0957 1.0977 1.0604 1.0657 1.0908
irintensity: 0.7312 0.4324 0.3544 1.3605 3.7927 0.2710 2.5943 1.1407 0.1335 0.3784 1.0067 0.8045 0.2758 10.4307 2.2619 6.2385 1.6943 0.4199 1.3484 2.0733 1.4063 8.4201 14.8645 1.6600 4.5898 1.4030 4.6933 82.3596 11.8552 8.3025 8.4517 37.2446 1.0923 0.4452 2.8772 15.3099 6.5257 8.5415 1.8900 0.5186 3.0771 12.6752 2.6824 151.0957 3.6999 5.2895 18.9994 3.6142 5.8809 13.2179 1.1039 14.3404 1.2715 6.5396 9.5205 26.1883 22.3023 4.1316 12.3140 20.6071 54.9825 95.8684 45.4766 26.2768 56.6382 14.7099 0.0686 13.1310 9.8430 33.8937 0.1002 2.9058 0.1395 38.0840 4.9732 14.4082 0.4933 13.9138 0.0774 11.2280 265.1624 90.6835 139.5164 40.5817 42.0011 689.5683 43.5247 21.0573 45.7406 75.4592 44.4882 449.5893 59.2825 1.2199 159.0894 22.9078 0.0384 156.4327 520.1019 12.0229 308.6363 79.4150 12.4354 5.0979 0.9120 20.7930 50.8729 21.4199 90.3494 1.9557 11.9282 133.2588 124.0927 12.7191 5.3341 12.9649 55.3644 317.8606 0.9265 673.8609 18.6085 36.2355 3.6660 15.3400 0.2668 23.0596 9.5575 183.1201 42.8101 19.3340 19.3974 16.7678 6.3297 29.1733 42.7716 4.7179 4.8370 13.7562 15.5783 5.1560 3.9571 38.6459 6.1711 0.8052 67.6705 28.2995 124.7474
temp: 298.150 k
press: 1.00000 atm
elementType: 8 8 8 8 8 8 8 7 6 6 6 6 6 6 6 6 6 6 6 6 6 6 6 6 6 6 6 6 6 6 6 6 1 1 1 1 1 1 1 1 1 1 1 1 1 1 1 1 1 1 1
symmnumber: 1
zpe: 995674.5 jmol-1
zpe.correction: 0.379232 hartree
zpe.thermalcorrener: 0.407750 hartree
zpe.thermalcorrenthalpy: 0.408695 hartree
zpe.thermalcorrgfe: 0.314630 hartree
zpe.sumelectzpe: -1505.026659 hartree
zpe.sumelectthermal: -1504.998141 hartree
zpe.sumelectthermalent: -1504.997197 hartree
zpe.sumelectthermalfe: -1505.091262 hartree
dipole: -6.7384 -0.0563 2.6528
dipole: 7.2420
quadrupole: -151.4477 -188.3861 -185.9187
quadrupole: -21.3606 -15.5837 3.9803
quadrupole: 23.8031 -13.1353 -10.6679 -21.3606 -15.5837 3.9803
hfenergy: -1505.4058914 hartree
pointgroup: C01 [X(C24H19N1O7)]
dipole: 2.6266893 -0.5730535 0.9434646 debye
polarizability: 561.1823555|19.5150311|252.1400835|-20.1620378|44.3024335|206.0750595 unknown
InChI: InChI=1S/C24H19NO7/c1-2-30-19(27)12-31-13-7-9-14(10-8-13)32-18-11-17(26)20-21(22(18)25)24(29)16-6-4-3-5-15(16)23(20)28/h3-11,26H,2,12,25H2,1H3
charge 0 multiplicity 1
51 atoms
O  0.145726 1.695381 0.645379
O  -1.885378 -1.804974 -2.13105
O  -4.761684 1.863458 1.874217
O  -4.487922 -2.196399 -1.878551
O  5.550932 0.468912 -0.352233
O  8.248394 -1.824917 0.38599
O  8.189318 0.007465 -1.067251
N  -2.213776 2.287126 1.719369
C  -3.370815 0.557418 0.380422
C  -3.285003 -0.502061 -0.608969
C  -5.880219 0.185738 0.573914
C  -5.80539 -0.853883 -0.391965
C  -4.660544 0.922405 0.990366
C  -2.197109 1.277807 0.791498
C  -4.503676 -1.249851 -1.02489
C  -2.012915 -0.802572 -1.166672
C  -0.937821 0.915279 0.196276
C  -0.846257 -0.092475 -0.757022
C  -7.131065 0.528137 1.150263
C  -6.985662 -1.541097 -0.771949
C  -8.297755 -0.158903 0.76738
C  -8.224485 -1.19764 -0.198101
C  1.486785 1.295117 0.356573
C  2.017101 0.106875 0.895272
C  2.291487 2.181811 -0.391096
C  4.190476 0.673357 -0.073835
C  3.376285 -0.21227 0.678132
C  3.64668 1.87027 -0.604542
C  6.165969 -0.736873 0.181384
C  7.627021 -0.757802 -0.264361
C  9.694024 -2.048252 0.055284
C  10.156267 -3.241917 0.88275
H  0.127639 -0.333671 -1.199273
H  -7.153375 1.333306 1.890772
H  -6.895991 -2.337159 -1.517674
H  -9.26252 0.106905 1.21297
H  -9.133414 -1.731793 -0.495986
H  -1.341107 2.754189 1.958195
H  -3.136416 2.517079 2.123871
H  -0.940294 -1.87486 -2.42582
H  1.381926 -0.557729 1.489659
H  1.855173 3.102803 -0.788124
H  3.778641 -1.133746 1.108258
H  4.300799 2.534733 -1.17592
H  6.126373 -0.759842 1.288588
H  5.665675 -1.649897 -0.202843
H  9.77347 -2.226778 -1.03225
H  10.24715 -1.122751 0.295827
H  11.221273 -3.449205 0.672774
H  10.048976 -3.040329 1.962107
H  9.572633 -4.145127 0.636085
