program: Gaussian 09
title: 000104132
version: EM64L-G09RevD.01
frameworkgroup: C1[X(C23H17NO7)]
method: RPBEPBE
basis: SDD
operation: Freq
keyword: #p
keyword: freq=noraman
keyword: PBEPBE/SDD
title: #p freq=noraman PBEPBE/SDD
converged: YES YES NO NO
title: Mulliken charges:
elementType: O O O O O O O N C C C C C C C C C C C C C C C C C C C C C C C H H H H H H H H H H H H H H H H H
charge: -0.331384 -0.363177 -0.304984 -0.180899 -0.240733 -0.272058 -0.193636 -0.648100 0.236412 0.215874 0.270874 0.254416 -0.126245 0.055582 -0.218663 0.125416 0.198247 -0.566165 -0.381425 -0.384052 -0.232621 -0.229298 0.333016 -0.366689 -0.353053 0.343986 -0.314856 -0.342899 -0.371084 0.216397 -0.494309 0.258627 0.289309 0.291508 0.234949 0.235062 0.387769 0.335490 0.355546 0.269211 0.264560 0.253818 0.266938 0.247123 0.244205 0.238622 0.246564 0.246807
chargesum: 0.00000
title: Mulliken charges with hydrogens summed into heavy atoms:
elementType: O O O O O O O N C C C C C C C C C C C C C C C C C C C C C C C
charge: -0.331384 -0.007631 -0.304984 -0.180899 -0.240733 -0.272058 -0.193636 0.075160 0.236412 0.215874 0.270874 0.254416 -0.126245 0.055582 -0.218663 0.125416 0.198247 -0.307538 -0.092116 -0.092545 0.002328 0.005765 0.333016 -0.097478 -0.088493 0.343986 -0.061038 -0.075961 0.120244 0.216397 0.237684
polarizability: 5.45805428e+02 -1.68756946e+01 2.71700520e+02 2.80344228e+01 1.33198234e+00 1.64069459e+02
1716.lowfreq: -4.7134 -2.9085 -0.0003 0.0012 0.0013 3.0989 7.1260 13.3912 16.3657
frequency: 6.3007 13.2725 16.3451 23.9083 38.0703 47.4012 56.5956 76.7682 89.2736 108.5419 112.1775 127.8036 137.9804 149.5461 160.6190 172.7511 195.3662 210.1732 215.7347 263.4692 264.9503 296.8578 301.0103 322.4904 337.1089 363.5568 367.4126 372.9039 394.6767 414.7308 418.7888 422.1365 428.2763 443.8810 448.8722 481.6731 482.7826 499.4495 506.0290 507.6019 554.9855 563.3587 566.3022 594.4875 626.5246 633.4566 637.7356 652.0339 675.3758 679.1248 710.2879 723.9652 732.5452 743.3771 763.3791 804.2952 808.9093 811.1405 821.9104 833.2411 837.0482 842.5559 864.7237 869.2147 879.6288 925.2464 936.0568 941.0045 946.1582 961.9451 992.5131 996.9154 1000.1015 1004.4373 1013.3571 1030.5481 1031.8682 1080.7028 1094.0466 1107.4789 1114.1174 1135.4238 1139.7990 1150.2361 1159.7734 1168.9610 1170.5857 1185.5213 1186.5203 1203.6655 1236.6814 1245.1150 1266.5026 1286.6655 1292.9761 1312.4151 1344.9815 1356.7595 1379.5997 1388.9945 1396.7456 1410.7530 1418.6304 1424.8322 1443.5954 1453.5394 1454.6830 1454.9978 1464.6407 1469.9987 1487.6712 1520.1094 1536.5192 1549.6692 1573.6700 1590.2786 1593.2995 1610.8160 1616.3495 1631.0567 1686.9386 2965.2625 3008.4773 3022.7064 3111.7248 3132.1965 3132.5910 3149.6414 3150.3241 3155.5925 3162.7583 3162.7846 3169.8135 3170.9153 3182.4300 3294.4283 3527.1756 3623.4646
redmass: 6.2302 7.5098 5.9036 4.6575 7.2413 5.1567 6.7098 5.7620 1.1065 5.1546 3.3900 6.5704 6.2201 5.3714 7.8051 3.2429 6.0545 5.7772 5.5131 7.0521 4.8263 6.7113 6.2521 6.1733 5.0833 1.4262 4.4080 5.2406 7.5276 7.4966 3.1700 3.5820 7.6254 6.2636 6.5997 4.9787 5.9934 7.0195 3.4639 3.8451 5.8177 1.2101 3.3107 5.8413 5.3242 6.9268 5.7954 5.8501 5.2491 5.6903 4.5489 5.3827 3.4817 3.0598 6.1000 2.9017 1.6755 1.9264 1.1287 5.5169 1.5542 1.6660 2.6555 6.0298 7.6266 4.6336 2.0177 1.4187 6.5168 1.3443 3.9268 1.3888 2.7480 1.8602 1.3587 2.5741 4.0326 3.3942 2.5360 1.2684 1.2624 4.1070 1.8529 1.4250 1.5452 1.3344 1.2111 2.1607 1.9308 1.0763 4.3301 2.0169 2.4439 3.7023 1.2895 3.8791 3.9043 1.9596 3.3363 8.2137 7.4780 3.4765 3.6523 1.1847 2.7815 1.1426 1.0497 4.0087 1.0504 2.7164 2.3099 8.8324 5.1720 2.1176 4.9891 7.5355 5.4170 6.7313 6.4813 7.7463 10.1294 1.0553 1.0296 1.1042 1.1049 1.0911 1.0862 1.0905 1.0881 1.1049 1.0890 1.0943 1.0963 1.0994 1.0978 1.0606 1.0657 1.0907
irintensity: 0.6535 1.0464 0.4837 1.2916 4.7554 0.0572 2.2424 0.6295 0.1185 1.2072 0.3926 1.1774 0.6585 5.9834 0.2617 14.4220 0.8517 2.2576 2.9599 7.5193 8.1068 7.0250 13.7122 5.4170 2.0207 58.8552 20.4051 19.7162 5.8473 34.0125 1.5638 0.6970 4.2268 14.4264 7.0303 5.5383 3.3215 0.7654 2.7419 13.0226 2.6030 150.9547 3.4452 5.6217 18.7937 3.9606 5.6010 6.3197 25.5734 5.1923 1.6599 6.3911 11.2624 24.0678 18.3069 18.2934 21.4259 48.2060 98.3877 54.7804 48.7585 41.0789 0.0698 7.2661 12.9766 32.7408 0.1092 2.8683 4.0555 0.0717 36.4449 4.7837 13.7207 0.5936 0.0465 14.6278 161.3761 86.5608 138.5117 24.9182 0.3600 683.0809 20.6456 1.9122 47.3112 93.9376 52.7369 246.9035 232.7635 1.7504 164.8119 19.5793 161.3461 527.3934 12.8469 298.4739 74.8412 13.5518 2.2939 20.2551 49.7168 89.7619 1.7297 21.1330 11.5466 147.8423 14.7420 118.1057 14.2416 5.1212 351.8867 1.1838 670.1357 21.3739 36.8505 3.4352 15.6679 0.2674 22.0902 9.5989 175.9632 44.2038 34.1307 16.1523 23.8878 4.7130 4.8294 14.1306 16.5825 13.3922 5.4189 2.9786 5.0124 38.5326 0.8041 67.5989 28.1920 124.7084
temp: 298.150 k
press: 1.00000 atm
elementType: 8 8 8 8 8 8 8 7 6 6 6 6 6 6 6 6 6 6 6 6 6 6 6 6 6 6 6 6 6 6 6 1 1 1 1 1 1 1 1 1 1 1 1 1 1 1 1 1
symmnumber: 1
zpe: 922474.2 jmol-1
zpe.correction: 0.351352 hartree
zpe.thermalcorrener: 0.378565 hartree
zpe.thermalcorrenthalpy: 0.379509 hartree
zpe.thermalcorrgfe: 0.288828 hartree
zpe.sumelectzpe: -1465.797370 hartree
zpe.sumelectthermal: -1465.770157 hartree
zpe.sumelectthermalent: -1465.769213 hartree
zpe.sumelectthermalfe: -1465.859895 hartree
dipole: 6.3636 -0.1086 -2.4741
dipole: 6.8285
quadrupole: -146.7621 -182.2622 -177.5667
quadrupole: 21.3639 -16.6106 -3.9082
quadrupole: 22.1016 -13.3985 -8.7030 21.3639 -16.6106 -3.9082
hfenergy: -1466.1487222 hartree
pointgroup: C01 [X(C23H17N1O7)]
dipole: 2.4881679 -0.4519782 0.9068175 debye
polarizability: 547.5183867|12.6545866|253.0567523|-18.7781159|39.9236557|181.0002685 unknown
InChI: InChI=1S/C23H17NO7/c1-29-18(26)11-30-12-6-8-13(9-7-12)31-17-10-16(25)19-20(21(17)24)23(28)15-5-3-2-4-14(15)22(19)27/h2-10,25H,11,24H2,1H3
charge 0 multiplicity 1
48 atoms
O  0.568819 1.663901 0.505145
O  -1.510993 -2.133106 -1.808094
O  -4.354211 2.136322 1.576901
O  -4.127125 -2.424243 -1.552363
O  5.951677 0.203222 -0.271196
O  8.545214 -2.148799 0.649406
O  8.624475 -0.308849 -0.7905
N  -1.793103 2.462685 1.42845
C  -2.973804 0.594606 0.31607
C  -2.900348 -0.595652 -0.512406
C  -5.496498 0.321959 0.499737
C  -5.43329 -0.847799 -0.304561
C  -4.26398 1.077156 0.837234
C  -1.787471 1.333792 0.650674
C  -4.131716 -1.364229 -0.844239
C  -1.627376 -1.003246 -0.995073
C  -0.528116 0.858629 0.140627
C  -0.448561 -0.273257 -0.662507
C  -6.747948 0.776877 0.990645
C  -6.625393 -1.551927 -0.609154
C  -7.926445 0.072561 0.682912
C  -7.864645 -1.096901 -0.120195
C  1.90319 1.202357 0.287257
C  2.400206 0.077026 0.973076
C  2.735807 1.973766 -0.552087
C  4.594447 0.471972 -0.032349
C  3.753215 -0.297236 0.812199
C  4.085025 1.608426 -0.709573
C  6.532155 -0.944977 0.406716
C  7.99711 -1.045731 -0.011156
C  9.978047 -2.419825 0.369216
H  0.525795 -0.598888 -1.045784
H  -6.761204 1.680463 1.607527
H  -6.543783 -2.44918 -1.230514
H  -8.891579 0.425384 1.062425
H  -8.782719 -1.644803 -0.359183
H  -2.717189 2.770548 1.773783
H  -0.912422 2.93589 1.621195
H  -0.56337 -2.266471 -2.071213
H  1.743426 -0.495444 1.635862
H  2.324893 2.848851 -1.063506
H  4.129682 -1.169563 1.354135
H  4.760468 2.183653 -1.348874
H  6.481252 -0.835652 1.509062
H  6.016286 -1.886351 0.128096
H  10.212317 -3.319241 0.954588
H  10.595398 -1.563967 0.689135
H  10.127781 -2.594712 -0.709148
