program: Gaussian 09
title: 000104070
version: EM64L-G09RevD.01
frameworkgroup: C1[X(C12H6O6S)]
method: RPBEPBE
basis: SDD
operation: Freq
keyword: #p
keyword: freq=noraman
keyword: PBEPBE/SDD
title: #p freq=noraman PBEPBE/SDD
converged: YES YES NO NO
title: Mulliken charges:
elementType: S O O O O O O C C C C C C C C C C C C H H H H H H
charge: 0.975212 -0.222873 -0.560150 -0.487052 -0.486776 -0.168501 -0.167972 0.215641 0.549326 -0.285485 0.106301 0.109652 -0.276071 -0.378143 -0.378620 -0.356817 -0.235716 0.115025 0.112935 0.305822 0.295225 0.291441 0.285565 0.251829 0.390199
chargesum: 0.00000
title: Mulliken charges with hydrogens summed into heavy atoms:
elementType: S O O O O O O C C C C C C C C C C C C
charge: 0.975212 -0.222873 -0.169950 -0.487052 -0.486776 -0.168501 -0.167972 0.215641 0.549326 -0.285485 0.106301 0.109652 0.029751 -0.082917 -0.087178 -0.071252 0.016113 0.115025 0.112935
polarizability: 2.45674356e+02 -5.44763981e+00 2.14392801e+02 -1.85652759e+00 -1.56808679e-02 8.29612982e+01
1716.lowfreq: -0.0016 -0.0010 -0.0004 5.2283 9.6813 11.2179 37.0531 48.7723 69.5832
frequency: 37.0113 48.7509 69.5810 127.1113 131.0668 150.2691 178.2577 186.2318 200.7804 204.5318 241.2367 290.3401 297.7359 319.0118 340.2143 356.8183 390.1514 408.0179 440.5606 452.0902 464.9109 467.8498 532.6905 550.0694 564.6875 576.7325 621.0392 640.5608 665.3753 705.2102 721.8270 785.8566 788.4547 809.0212 835.2562 850.1436 887.9205 909.4867 921.7268 959.6581 967.0891 1001.9810 1011.2752 1033.3180 1047.3432 1060.1971 1103.1381 1151.9774 1192.9239 1210.2234 1227.1803 1280.8423 1357.2159 1393.5983 1415.3446 1430.7664 1452.8614 1511.7107 1578.6002 1586.3652 1621.6751 1651.4027 1687.7146 3155.0375 3156.4733 3167.6255 3174.8716 3181.3423 3480.4512
redmass: 10.8262 8.9963 8.2158 9.5233 14.4600 6.7602 2.3086 5.4146 5.8243 5.6602 2.3820 6.5257 6.1294 7.5165 8.6830 12.7615 11.1913 11.3426 5.0959 7.8584 7.7645 3.5276 10.5029 6.8588 7.4319 8.1584 4.7698 8.2080 10.4166 4.1317 6.3902 2.2781 5.5557 8.3196 10.5719 2.6697 1.3706 8.1085 10.8262 1.8821 4.2217 1.3869 1.3888 3.8571 1.3032 3.4822 2.0377 2.2249 1.4187 1.5047 2.3837 2.3077 3.0564 3.4271 3.6900 7.0680 2.4217 4.6207 7.6027 6.0894 8.0728 12.5931 12.7712 1.0883 1.0901 1.0928 1.0960 1.0995 1.0662
irintensity: 0.2693 3.3486 0.9102 4.3676 0.2831 6.2354 25.2052 1.6350 6.1690 5.2814 52.9604 16.3286 7.9307 30.6161 10.8665 28.9860 22.7501 37.3173 4.5181 9.0956 14.7799 2.7806 96.9297 11.9275 42.1905 13.0695 4.6364 1.6622 13.3187 6.4512 18.8095 41.1099 0.3254 10.4063 52.8301 38.3538 34.9426 47.3673 303.7831 30.5519 48.0397 0.1491 0.6747 11.8568 106.1575 62.0929 3.7058 21.4866 11.9765 24.9376 84.4200 83.6245 15.7120 1.4487 3.5712 9.3248 7.9271 16.7008 71.7485 47.0733 11.8117 285.3390 295.5870 3.0755 7.5308 2.4988 2.8414 4.6439 58.5961
temp: 298.150 k
press: 1.00000 atm
elementType: 16 8 8 8 8 8 8 6 6 6 6 6 6 6 6 6 6 6 6 1 1 1 1 1 1
symmnumber: 1
zpe: 409235.3 jmol-1
zpe.correction: 0.155869 hartree
zpe.thermalcorrener: 0.171940 hartree
zpe.thermalcorrenthalpy: 0.172884 hartree
zpe.thermalcorrgfe: 0.112064 hartree
zpe.sumelectzpe: -1308.807498 hartree
zpe.sumelectthermal: -1308.791428 hartree
zpe.sumelectthermalent: -1308.790483 hartree
zpe.sumelectthermalfe: -1308.851304 hartree
dipole: 3.7427 2.6448 1.3104
dipole: 4.7665
quadrupole: -150.9097 -109.8481 -117.0749
quadrupole: -2.5265 10.2306 2.2413
quadrupole: -24.9654 16.0961 8.8693 -2.5265 10.2306 2.2413
hfenergy: -1308.9633679 hartree
pointgroup: C01 [X(C12H6O6S1)]
dipole: -1.481988 1.003562 -0.5597211 debye
dipolederiv: 2.1030571 0.0338876 0.0511886 -0.06829 1.1648664 -0.0773233 0.2086936 -0.0596948 1.5732725 -0.6389561 -0.2805897 0.0027935 -0.2828575 -1.5341801 0.0198125 0.0048316 0.0199448 -0.2342436 -0.5382673 0.0076205 -0.1816621 0.0396199 -0.5363316 0.1378768 -0.323731 0.1121381 -0.9539363 -0.7478678 -0.097433 0.0184118 -0.1004027 -0.554604 0.0629168 -0.0235883 -0.0038157 -0.4524667 -0.7457868 0.0192161 0.010844 0.0500847 -0.5167435 -0.1274732 0.017225 -0.0415083 -0.5279896 -0.6746938 0.2517708 -0.0061639 0.3263186 -1.0612419 0.0131305 -0.0044223 0.010251 -0.3073495 -1.0849431 -0.3097982 0.002699 -0.4055518 -0.7046888 0.0056464 0.0089143 0.0072063 -0.3064421 -0.0098375 0.2010154 -0.0034137 -0.0485797 -0.0119226 -0.0059822 -0.0170039 -0.000297 0.0048409 -0.4031921 -0.1146521 -0.009188 0.422754 -0.0415908 0.0136393 0.0051377 0.0072533 0.0844419 0.0496155 0.0926495 0.0085903 -0.0691883 0.1016668 -0.0235408 0.13102 -0.0403751 -0.1468112 -0.5748023 0.1117052 -0.0047836 -0.0042772 0.0108578 0.0013674 0.0029085 -0.0005036 0.0361945 -0.576549 0.1056918 -0.0043818 0.3578625 -0.2279622 0.0065845 0.0013776 0.0028865 0.0150371 -0.1991324 0.2620473 -0.0062491 -0.1032652 -0.2354092 0.0010215 -0.0136902 0.0070267 -0.0763438 0.0886695 -0.2931729 0.0020279 0.0809778 0.0314093 0.0021201 -0.0163935 0.0041889 -0.0823425 0.1453598 -0.038308 0.011569 0.0434751 0.0626614 -0.0070837 -0.0011239 0.0143202 -0.0741707 0.2761367 0.1460212 -0.0028189 -0.1768627 0.0046966 -0.0031248 -0.0019945 -0.002682 -0.0700817 -0.2704365 -0.2090598 -0.0017633 -0.188015 0.1671136 -0.0032902 0.0079473 -0.0029895 -0.1277326 1.5752609 0.0952937 0.0024124 -0.1478388 1.640182 -0.0213228 0.0011967 -0.019922 0.2978514 1.6970318 -0.0120358 0.0019006 0.2194529 1.579352 -0.0210147 -0.0075345 -0.0187848 0.3003747 0.1191274 -0.0455482 0.0085516 -0.0236451 0.1295506 -0.0014272 0.0079217 0.0006097 0.1592319 0.0754666 0.0443321 -0.0015863 0.012201 0.056807 0.0013907 0.0045618 -0.0003052 0.1587871 0.075203 0.051835 0.0024261 0.0076148 0.1213871 0.0049157 -0.011971 -0.0173244 0.1285162 0.0566068 -0.070793 0.0008455 -0.034418 0.0849254 0.0013871 0.0004342 0.0011955 0.1517219 0.0728165 0.0407633 0.0003981 0.0357275 -0.0561528 0.0026507 0.000585 0.0021391 0.1561567 0.1301131 0.0075409 0.0973522 0.0571032 0.3253517 0.0171227 0.0186983 0.0190421 0.2934835 unknown
polarizability: 245.4642997|6.0634762|214.5859961|1.1904361|-1.9201485|82.9781595 unknown
InChI: InChI=1S/C12H6O6S/c13-11-7-3-1-2-6-9(19(15,16)17)5-4-8(10(6)7)12(14)18-11/h1-5,15H
charge 0 multiplicity 1
25 atoms
S  -3.522458 -0.228839 0.035715
O  3.443315 -0.659245 0.024049
O  -3.561282 0.334548 -1.731151
O  -4.310163 -1.631771 0.184401
O  -3.928695 1.02363 0.975695
O  2.869655 -2.878567 0.057285
O  4.088833 1.541858 -0.012871
C  0.683344 0.102622 0.023818
C  -0.711816 0.497903 0.020664
C  -1.659255 -0.571997 0.03438
C  1.036119 -1.287124 0.03824
C  1.696441 1.116258 0.004121
C  -1.326857 -1.922326 0.046155
C  0.048474 -2.281301 0.053406
C  -1.040891 1.893467 0.005362
C  1.343056 2.473923 -0.013859
C  -0.027076 2.856329 -0.01282
C  2.466568 -1.704728 0.041485
C  3.135226 0.749279 0.003214
H  -2.113729 -2.683143 0.054743
H  0.353418 -3.33194 0.065559
H  -2.089644 2.201717 0.020426
H  2.139372 3.224851 -0.028024
H  -0.289915 3.918254 -0.024389
H  -4.511241 0.545943 -1.968704
